{"text_format":"1","workbook":"xlsx","n_sheets":4,"sheets":["CONTRIBUENTE","DATI del VERSAMENTO","F 23","Tabelle"],"not_rendered":{"charts":0,"images":7,"macros":1,"external_links":0,"defined_names":6,"comments":0,"pivot_tables":0},"unopened":[],"bounds":{"document_bytes":16777216,"sheet_cells":100000,"rows_first":2000,"rows_last":500,"rows_between":2000,"halvings":0,"cell_chars":16384,"cell_head_chars":4096},"cells_cut":0,"cells_raw":0,"read":"whole","date_system":"1900"}

{"sheet":"CONTRIBUENTE","index":0,"n_rows":163,"n_cols":107,"rows_kept":163,"cut":false,"hidden":false,"merged":[[1,2,1,15],[2,2,2,15],[3,2,3,11],[5,2,5,15],[20,2,20,12],[11,19,11,20],[18,2,18,6],[19,2,19,6],[12,6,12,15],[15,2,15,8],[15,9,15,11],[17,2,17,6],[18,9,18,14],[17,9,17,14],[12,2,12,4],[16,2,16,7],[13,1,13,15],[14,1,14,15],[9,2,9,7],[9,9,9,12],[106,2,106,15],[107,2,107,15],[6,2,6,15],[71,2,71,6],[72,2,72,10],[33,2,33,3],[19,9,19,14],[29,2,29,14],[28,2,28,14],[53,2,53,14],[54,2,54,14],[25,12,25,15],[88,12,89,12],[89,4,89,6],[68,10,68,15],[72,11,72,15],[42,4,42,7],[42,9,42,10],[56,2,56,6],[76,2,76,15],[49,2,49,15],[80,2,80,15],[24,2,24,6],[31,2,31,3],[35,2,35,3],[26,9,26,15],[34,4,34,14],[33,4,33,12],[30,2,30,15],[35,4,35,7],[35,9,35,10],[110,1,110,7],[110,11,110,15],[109,2,109,15],[38,3,38,6],[50,2,50,15],[47,2,47,15],[51,2,51,15],[74,2,74,15],[70,1,70,15],[61,3,61,4],[105,2,105,15],[108,2,108,15],[60,5,60,15],[31,4,31,14],[103,2,103,15],[86,2,86,15],[104,2,104,15],[90,4,90,7],[102,2,102,12],[102,13,102,15],[100,2,100,15],[69,8,69,15],[67,10,67,15],[59,2,59,15],[65,5,65,15],[65,3,65,4],[75,2,75,15],[81,2,81,15],[82,12,82,15],[52,3,52,14],[37,3,37,6],[57,2,57,15],[38,9,38,12],[58,2,58,15],[85,8,85,10],[71,7,71,15],[63,10,63,15],[61,5,61,15],[36,4,36,7],[36,9,36,10],[37,9,37,12],[48,2,48,15],[43,4,43,7],[46,2,46,15],[43,9,43,10],[45,3,45,6],[45,9,45,12],[42,2,42,3],[44,3,44,6],[44,9,44,12],[40,2,40,3],[40,4,40,12],[41,4,41,14]]}
[]
[null,null,"Questo file contiene UNA MACRO (non indispensabile) nel foglio F23.  Puoi attivarla anche in un secondo momento, quando"]
[null,null,"riapri il file. Per utilizzarla assicurati di salvare il file nel formato con macro ATTIVE. Le macro sono COMANDI automatici che completano"]
[null,null,"le funzionalità di questo strumento, non contengono virus o altro.  Qui trovi la spiegazione di Microsoft:",null,null,null,null,null,null,null,null,null,"MACRO"]
[null,null,"Sistema interamente originale. Non necessita di aggiornamenti."]
[null,null,"di Marco Piccoli - P. IVA 01151800313"]
[null,null,"Monfalcone - GO - Tel. 333 46 39 497"]
[null,null,null,null,null,null,null,null,null,null,null,null,null,null,null,"Professionista Web di cui alla legge nr. 4/2013"]
[null,null,"Leggi attentamente questa presentazione, osserva le \"Note pratiche\" e richiedi liberamente informazioni via mail."]
[null,null,"Una copia di questo file è sempre disponibile al sito www.marcopiccoli.it:",null,null,null,null,null,null,"Area Download .xlsx / xlsm"]
[]
[null,null,"Puoi usare questo file per annotare i tuoi F23 di TUTTI i MESI di OGNI ANNO. Al momento il trimestre selezionato è:",null,null,null,null,null,null,null,null,null,null,null,null,null,null,null,null,"DAL  - GG/MM -  AL"]
[null,null,{"$f":"I86","v":"1° TRIMESTRE"},null,null,null,{"$f":"IF(J140=\"\",IF(E139=1,B136,\"\"),J140)","v":""},null,null,null,null,null,null,null,null,null,null,null,null,{"$f":"IF(I86=\"\",F159,VLOOKUP(I86,C159:G162,4,FALSE))","v":"2024-01-01"},{"$f":"IF(I86=\"\",G159,VLOOKUP(I86,C159:G162,5,FALSE))","v":"2024-03-31"}]
[null,"Questo strumento è liberamente utilizzabile DA TUTTI. Funziona integralmente per OGNI TRIMESTRE di ogni"]
[null,"ANNO. Puoi sbloccarlo in qualsiasi momento per l' INTERO ANNO. I valori che inserisci sono sempre disponibili."]
[null,null,{"$f":"IF(K68=J144,B127,B126)","v":"Richiedi via mail il TUO CODICE di PROPRIETA' per EXCEL:"},null,null,null,null,null,null,"info@marcopiccoli.it"]
[null,null,"Note pratiche:"]
[null,null,"USA IL TASTO - TAB - PER MUOVERE IL CURSORE NELLE",null,null,null,null,null,null,"USA IL TASTO - Canc - PER RIMUOVERE IL"]
[null,null,"CELLE LIBERE. TUTTE LE ALTRE SONO BLOCCATE E NON",null,null,null,null,null,null,"CONTENUTO DI UNA CELLA. PER MAC USA"]
[null,null,"TI SERVONO PER IL CORRETTO USO DI QUESTO FILE.",null,null,null,null,null,null,"- doppio tasto -   NON TAGLIARE LE CELLE."]
{"$rows_left_out":144}
{"sheet":"DATI del VERSAMENTO","index":1,"n_rows":1068,"n_cols":33,"rows_kept":1068,"cut":false,"hidden":false,"merged":[[3,3,3,4],[5,4,6,4],[1009,3,1009,4],[4,3,4,4],[1,9,1,18],[2,9,2,12],[3,9,3,10],[1,3,1,4],[2,3,2,4],[5,28,6,28],[5,17,5,18],[4,20,4,22],[5,20,5,22],[1010,3,1010,4]]}
[]
[null,null,null,"Contribuente:",null,null,null,null,null,"Compila le righe di questa sezione una sotto l' altra, assegnando un numero di protocollo progressivo e la data in ogni riga."]
[null,null,null,{"$f":"CONTRIBUENTE!J38","v":"01234567891"},null,null,null,null,null,"Nel foglio \\ F 23 / potrai richiamare e stampare tutti i documenti così generati."]
[null,null,null,"Stesso nr. di PROT. =",null,null,null,null,null,"Dettaglio Versamento"]
[null,null,null,"stesso DOCUMENTO",null,null,null,null,null,{"$f":"IF(M1019=0,\"\",CONTRIBUENTE!$F$134)","v":""},null,null,null,null,null,null,null,null,null,null,"Vedi foglio  \\ Tabelle /"]
[null,null,null,"NR.","DATA",null,"Prov.","Ufficio",null,"CODICE","Descrizione libera","importi a debito","codice",null,"Conten-",null,null,"Estremi atto o documento",null,null,"Delega irrevocabile a",null,null,null,"Addeb.",null,"Protocollo",null,"N O T E"]
[null,null,null,"Prot.",null,null,"Concess.","o ente",null,"TRIBUTO","(campo ris. all' ufficio)","VERSATI","destinatario",null,"zioso","CAUSALE",null,"ANNO","NUMERO",null,null,"ABI","CAB",null,"IBAN",null,"alfanumerico"]
[]
["1 di 1000",{"$f":"IF(AG9=$AG$1013,0,IF(M$1019=1,0,D9&\"-\"&YEAR(E9)))","v":"1-2024"},{"$f":"IF(M$1019=1,0,B9&\"-\"&AE9)","v":"1-2024-1"},1,"2024-01-01",null,"PV",null,null,"0001",null,1000,"0001",null,1,"IN",null,"1999","123456",null,"B1",{"$f":"IF(M$1019=1,\"\",IF(U9=\"\",\"\",VLOOKUP(U9,Tabelle!$B$4:$O$6,14,FALSE)))","v":"00001"},{"$f":"IF(M$1019=1,\"\",IF(U9=\"\",\"\",VLOOKUP(U9,Tabelle!$B$4:$Q$6,16,FALSE)))","v":"10000"},null,"B1",null,"AB 100",null,"Testo Libero",null,1,null,{"$f":"IF(E9>0,IF(OR(MONTH(E9)<$L$1030,MONTH(E9)>$L$1031),AG$1013,0),0)","v":0}]
["2",{"$f":"IF(AG10=$AG$1013,0,IF(M$1019=1,0,D10&\"-\"&YEAR(E10)))","v":"2-2024"},"2-2024-1",2,"2024-01-01",null,"MI",null,null,"0002",null,2000,"0002",null,2,"VT",null,"2000","AAAAA",null,"B2",{"$f":"IF(M$1019=1,\"\",IF(U10=\"\",\"\",VLOOKUP(U10,Tabelle!$B$4:$O$6,14,FALSE)))","v":"00002"},{"$f":"IF(M$1019=1,\"\",IF(U10=\"\",\"\",VLOOKUP(U10,Tabelle!$B$4:$Q$6,16,FALSE)))","v":"20000"},null,"B2",null,"CD 100",null,"Testo Libero riga 1",null,{"$f":"IF(B10=\"\",0,IF(B10=B9,COUNTIF(B$9:B9,B10)+1,1))","v":1},{"$f":"IF(OR(D10=\"\",M$1019=1),0,IF(AE10=8,1,0))","v":0},{"$f":"IF(E10>0,IF(OR(MONTH(E10)<$L$1030,MONTH(E10)>$L$1031),AG$1013,0),0)","v":0}]
["3","2-2024","2-2024-2",2,"2024-01-01",null,null,null,null,"0003",null,3000,"0003",null,null,null,null,null,null,null,null,{"$f":"IF(M$1019=1,\"\",IF(U11=\"\",\"\",VLOOKUP(U11,Tabelle!$B$4:$O$6,14,FALSE)))","v":""},{"$f":"IF(M$1019=1,\"\",IF(U11=\"\",\"\",VLOOKUP(U11,Tabelle!$B$4:$Q$6,16,FALSE)))","v":""},null,null,null,null,null,"Testo Libero riga 2",null,{"$f":"IF(B11=\"\",0,IF(B11=B10,COUNTIF(B$9:B10,B11)+1,1))","v":2},0,0]
["4","2-2024","2-2024-3",2,"2024-01-01",null,null,null,null,"A999",null,10000,"A999",null,null,null,null,null,null,null,null,{"$f":"IF(M$1019=1,\"\",IF(U12=\"\",\"\",VLOOKUP(U12,Tabelle!$B$4:$O$6,14,FALSE)))","v":""},{"$f":"IF(M$1019=1,\"\",IF(U12=\"\",\"\",VLOOKUP(U12,Tabelle!$B$4:$Q$6,16,FALSE)))","v":""},null,null,null,null,null,"Righe di esempio",null,{"$f":"IF(B12=\"\",0,IF(B12=B11,COUNTIF(B$9:B11,B12)+1,1))","v":3},0,0]
["5","-1900","-1900-1",null,null,null,null,null,null,null,null,null,null,null,null,null,null,null,null,null,null,{"$f":"IF(M$1019=1,\"\",IF(U13=\"\",\"\",VLOOKUP(U13,Tabelle!$B$4:$O$6,14,FALSE)))","v":""},{"$f":"IF(M$1019=1,\"\",IF(U13=\"\",\"\",VLOOKUP(U13,Tabelle!$B$4:$Q$6,16,FALSE)))","v":""},null,null,null,null,null,null,null,{"$f":"IF(B13=\"\",0,IF(B13=B12,COUNTIF(B$9:B12,B13)+1,1))","v":1},0,0]
["6","-1900","-1900-2",null,null,null,null,null,null,null,null,null,null,null,null,null,null,null,null,null,null,{"$f":"IF(M$1019=1,\"\",IF(U14=\"\",\"\",VLOOKUP(U14,Tabelle!$B$4:$O$6,14,FALSE)))","v":""},{"$f":"IF(M$1019=1,\"\",IF(U14=\"\",\"\",VLOOKUP(U14,Tabelle!$B$4:$Q$6,16,FALSE)))","v":""},null,null,null,null,null,null,null,{"$f":"IF(B14=\"\",0,IF(B14=B13,COUNTIF(B$9:B13,B14)+1,1))","v":2},0,0]
["7","-1900","-1900-3",null,null,null,null,null,null,null,null,null,null,null,null,null,null,null,null,null,null,{"$f":"IF(M$1019=1,\"\",IF(U15=\"\",\"\",VLOOKUP(U15,Tabelle!$B$4:$O$6,14,FALSE)))","v":""},{"$f":"IF(M$1019=1,\"\",IF(U15=\"\",\"\",VLOOKUP(U15,Tabelle!$B$4:$Q$6,16,FALSE)))","v":""},null,null,null,null,null,null,null,{"$f":"IF(B15=\"\",0,IF(B15=B14,COUNTIF(B$9:B14,B15)+1,1))","v":3},0,0]
["8","-1900","-1900-4",null,null,null,null,null,null,null,null,null,null,null,null,null,null,null,null,null,null,{"$f":"IF(M$1019=1,\"\",IF(U16=\"\",\"\",VLOOKUP(U16,Tabelle!$B$4:$O$6,14,FALSE)))","v":""},{"$f":"IF(M$1019=1,\"\",IF(U16=\"\",\"\",VLOOKUP(U16,Tabelle!$B$4:$Q$6,16,FALSE)))","v":""},null,null,null,null,null,null,null,{"$f":"IF(B16=\"\",0,IF(B16=B15,COUNTIF(B$9:B15,B16)+1,1))","v":4},0,0]
["9","-1900","-1900-5",null,null,null,null,null,null,null,null,null,null,null,null,null,null,null,null,null,null,{"$f":"IF(M$1019=1,\"\",IF(U17=\"\",\"\",VLOOKUP(U17,Tabelle!$B$4:$O$6,14,FALSE)))","v":""},{"$f":"IF(M$1019=1,\"\",IF(U17=\"\",\"\",VLOOKUP(U17,Tabelle!$B$4:$Q$6,16,FALSE)))","v":""},null,null,null,null,null,null,null,{"$f":"IF(B17=\"\",0,IF(B17=B16,COUNTIF(B$9:B16,B17)+1,1))","v":5},0,0]
["10","-1900","-1900-6",null,null,null,null,null,null,null,null,null,null,null,null,null,null,null,null,null,null,{"$f":"IF(M$1019=1,\"\",IF(U18=\"\",\"\",VLOOKUP(U18,Tabelle!$B$4:$O$6,14,FALSE)))","v":""},{"$f":"IF(M$1019=1,\"\",IF(U18=\"\",\"\",VLOOKUP(U18,Tabelle!$B$4:$Q$6,16,FALSE)))","v":""},null,null,null,null,null,null,null,{"$f":"IF(B18=\"\",0,IF(B18=B17,COUNTIF(B$9:B17,B18)+1,1))","v":6},0,0]
["11","-1900","-1900-7",null,null,null,null,null,null,null,null,null,null,null,null,null,null,null,null,null,null,{"$f":"IF(M$1019=1,\"\",IF(U19=\"\",\"\",VLOOKUP(U19,Tabelle!$B$4:$O$6,14,FALSE)))","v":""},{"$f":"IF(M$1019=1,\"\",IF(U19=\"\",\"\",VLOOKUP(U19,Tabelle!$B$4:$Q$6,16,FALSE)))","v":""},null,null,null,null,null,null,null,{"$f":"IF(B19=\"\",0,IF(B19=B18,COUNTIF(B$9:B18,B19)+1,1))","v":7},0,0]
["12","-1900","-1900-8",null,null,null,null,null,null,null,null,null,null,null,null,null,null,null,null,null,null,{"$f":"IF(M$1019=1,\"\",IF(U20=\"\",\"\",VLOOKUP(U20,Tabelle!$B$4:$O$6,14,FALSE)))","v":""},{"$f":"IF(M$1019=1,\"\",IF(U20=\"\",\"\",VLOOKUP(U20,Tabelle!$B$4:$Q$6,16,FALSE)))","v":""},null,null,null,null,null,null,null,{"$f":"IF(B20=\"\",0,IF(B20=B19,COUNTIF(B$9:B19,B20)+1,1))","v":8},{"$f":"IF(OR(D20=\"\",M$1019=1),0,IF(AE20=8,1,0))","v":0},0]
{"$rows_left_out":1049}
{"sheet":"F 23","index":2,"n_rows":55,"n_cols":50,"rows_kept":55,"cut":false,"hidden":false,"merged":[[39,4,39,26],[46,6,46,17],[45,6,45,17],[51,12,51,18],[52,12,52,18],[53,12,53,18],[53,19,53,25],[51,5,51,11],[43,1,43,5],[44,1,44,5],[45,1,45,5],[46,1,46,5],[52,5,52,11],[42,1,42,5],[11,49,12,49],[23,11,23,27],[43,6,43,17],[44,6,44,17],[12,2,12,25],[12,26,12,37],[12,39,12,40],[12,41,12,42],[14,3,14,4],[14,10,14,23],[29,11,29,27],[14,27,14,28],[14,39,14,40],[16,2,16,25],[16,26,16,37],[16,39,16,40],[18,3,18,4],[18,10,18,23],[18,27,18,28],[18,39,18,40],[29,3,29,4],[30,3,30,4],[24,1,24,2],[25,1,25,2],[56,43,56,44],[18,41,18,42],[14,41,14,42],[21,41,21,42],[30,40,30,41],[16,41,16,42],[27,40,27,41],[28,40,28,41],[29,40,29,41],[23,40,23,41],[51,37,51,41],[52,37,52,41],[28,38,28,39],[29,38,29,39],[30,38,30,39],[33,1,33,47],[29,7,29,8],[30,7,30,8],[28,30,28,37],[29,30,29,37],[30,30,30,37],[36,10,36,11],[54,12,54,18],[51,43,51,46],[3,23,3,47],[5,23,5,47],[7,45,7,47],[7,27,7,43],[23,30,23,37],[21,2,21,3],[21,27,21,28],[21,39,21,40],[23,1,23,2],[23,3,23,4],[21,23,21,24],[21,6,21,7],[23,5,23,6],[23,7,23,8],[23,38,23,39],[21,4,21,5],[26,1,26,2],[27,1,27,2],[24,30,24,37],[25,30,25,37],[26,30,26,37],[27,30,27,37],[30,5,30,6],[25,7,25,8],[26,7,26,8],[27,7,27,8],[25,5,25,6],[26,5,26,6],[27,5,27,6],[28,5,28,6],[24,5,24,6],[24,7,24,8],[24,11,24,27],[29,5,29,6],[30,11,30,27],[25,11,25,27],[26,11,26,27],[27,11,27,27],[28,11,28,27],[28,7,28,8],[36,14,36,20],[36,21,36,27],[36,1,36,2],[36,3,36,4],[36,5,36,6],[36,7,36,8],[24,40,24,41],[25,40,25,41],[26,40,26,41],[31,30,31,37],[31,38,31,39],[31,40,31,41],[24,38,24,39],[25,38,25,39],[26,38,26,39],[27,38,27,39],[28,1,28,2],[29,1,29,2],[30,1,30,2],[24,3,24,4],[25,3,25,4],[26,3,26,4],[27,3,27,4],[28,3,28,4]]}
[]
[null,null,null,null,null,null,null,null,null,null,null,null,null,null,null,null,null,null,null,null,null,null,null,null,null,null,null,null,null,null,null,null,null,null,null,null,null,null,null,null,null,null,null,null,null,null,null,null,null,"ANNO"]
[null,null,null,null,null,null,null,null,null,null,null,null,null,null,null,null,null,null,null,null,null,null,null,null,null,null,null,null,null,null,null,null,null,null,null,null,null,null,null,null,null,null,null,null,null,null,null,null,null,2024]
[null,null,null,null,null,null,null,null,null,null,null,null,null,null,null,null,null,null,null,null,null,null,null,{"$f":"VLOOKUP(VLOOKUP(AX5&\"-\"&AX3,'DATI del VERSAMENTO'!B9:G1008,6,FALSE),'DATI del VERSAMENTO'!G1019:H1068,2,FALSE)","v":"Inserisci Provincia"},null,null,null,null,null,null,null,null,null,null,null,null,null,null,null,null,null,null,null,null,null,null,null,null,null,"Protocollo DOC."]
[null,null,null,null,null,null,null,null,null,null,null,null,null,null,null,null,null,null,null,null,null,null,null,null,null,null,null,null,null,null,null,null,null,null,null,null,null,null,null,null,null,null,null,null,null,null,null,null,null,1]
[null,null,null,null,null,null,null,null,null,null,null,null,null,null,null,null,null,null,null,null,null,null,null,{"$f":"VLOOKUP(VLOOKUP(AX5&\"-\"&AX3,'DATI del VERSAMENTO'!B9:U1008,20,FALSE),Tabelle!B4:C6,2,FALSE)","v":"Nome Banca 1 / modifica sigla"}]
[]
[null,null,null,null,null,null,null,null,null,null,null,null,null,null,null,null,null,null,null,null,null,null,null,null,null,null,null,{"$f":"VLOOKUP(VLOOKUP(AX5&\"-\"&AX3,'DATI del VERSAMENTO'!B9:U1008,20,FALSE),Tabelle!B4:I6,8,FALSE)","v":"Nome Agenzia 1"},null,null,null,null,null,null,null,null,null,null,null,null,null,null,null,null,null,{"$f":"VLOOKUP(VLOOKUP(AX5&\"-\"&AX3,'DATI del VERSAMENTO'!B9:U1008,20,FALSE),Tabelle!B4:N6,13,FALSE)","v":"XX"}]
[]
[]
[null,null,null,null,null,null,null,null,null,null,null,null,null,null,null,null,null,null,null,null,null,null,null,null,null,null,null,null,null,null,null,null,null,null,null,null,null,null,null,null,null,null,null,null,null,null,null,null,null,"Alfanumerico"]
[null,null,null,null,null,null,null,null,null,null,null,null,null,null,null,null,null,null,null,null,null,null,null,null,null,null,null,null,null,null,null,null,null,null,null,null,null,null,null,null,null,null,null,null,null,null,null,null,null,{"$f":"VLOOKUP($AX$5&\"-\"&$AX$3,'DATI del VERSAMENTO'!$B$9:$AA$1008,26,FALSE)","v":"AB 100"}]
[null,null,{"$f":"CONTRIBUENTE!E34","v":"Anagrafica CONTRIBUENTE"},null,null,null,null,null,null,null,null,null,null,null,null,null,null,null,null,null,null,null,null,null,null,null,{"$f":"CONTRIBUENTE!E36","v":"Nome CONTRIBUENTE"},null,null,null,null,null,null,null,null,null,null,null,{"$f":"MID(TEXT(CONTRIBUENTE!J36,\"gg/mm/aaaa\"),1,1)","v":"0"},{"$f":"MID(TEXT(CONTRIBUENTE!J36,\"gg/mm/aaaa\"),2,1)","v":"1"},null,{"$f":"MID(TEXT(CONTRIBUENTE!J36,\"gg/mm/aaaa\"),4,1)","v":"0"},null,{"$f":"MID(TEXT(CONTRIBUENTE!J36,\"gg/mm/aaaa\"),5,1)","v":"1"},{"$f":"MID(TEXT(CONTRIBUENTE!J36,\"gg/mm/aaaa\"),7,1)","v":"2"},{"$f":"MID(TEXT(CONTRIBUENTE!J36,\"gg/mm/aaaa\"),8,1)","v":"0"},{"$f":"MID(TEXT(CONTRIBUENTE!J36,\"gg/mm/aaaa\"),9,1)","v":"0"},{"$f":"MID(TEXT(CONTRIBUENTE!J36,\"gg/mm/aaaa\"),10,1)","v":"0"}]
[]
[null,null,null,{"$f":"VLOOKUP(CONTRIBUENTE!M36,CONTRIBUENTE!$E$148:$F$149,2,FALSE)","v":{"$error":"#N/A"}},null,null,null,null,null,null,{"$f":"CONTRIBUENTE!D38","v":0},null,null,null,null,null,null,null,null,null,null,null,null,null,null,null,{"$f":"LEFT(CONTRIBUENTE!H38,1)","v":""},{"$f":"RIGHT(CONTRIBUENTE!H38,1)","v":""},null,null,{"$f":"MID(CONTRIBUENTE!$J38,1,1)","v":"0"},{"$f":"MID(CONTRIBUENTE!$J38,2,1)","v":"1"},{"$f":"MID(CONTRIBUENTE!$J38,3,1)","v":"2"},{"$f":"MID(CONTRIBUENTE!$J38,4,1)","v":"3"},{"$f":"MID(CONTRIBUENTE!$J38,5,1)","v":"4"},{"$f":"MID(CONTRIBUENTE!$J38,6,1)","v":"5"},{"$f":"MID(CONTRIBUENTE!$J38,7,1)","v":"6"},{"$f":"MID(CONTRIBUENTE!$J38,8,1)","v":"7"},{"$f":"MID(CONTRIBUENTE!$J38,9,1)","v":"8"},{"$f":"MID(CONTRIBUENTE!$J38,10,1)","v":"9"},null,{"$f":"MID(CONTRIBUENTE!$J38,11,1)","v":"1"},null,{"$f":"MID(CONTRIBUENTE!$J38,12,1)","v":""},{"$f":"MID(CONTRIBUENTE!$J38,13,1)","v":""},{"$f":"MID(CONTRIBUENTE!$J38,14,1)","v":""},{"$f":"MID(CONTRIBUENTE!$J38,15,1)","v":""},{"$f":"MID(CONTRIBUENTE!$J38,16,1)","v":""},null,{"$f":"T54","v":""}]
[]
[null,null,{"$f":"CONTRIBUENTE!E41","v":0},null,null,null,null,null,null,null,null,null,null,null,null,null,null,null,null,null,null,null,null,null,null,null,{"$f":"CONTRIBUENTE!E43","v":0},null,null,null,null,null,null,null,null,null,null,null,{"$f":"MID(TEXT(CONTRIBUENTE!J43,\"gg/mm/aaaa\"),1,1)","v":"0"},{"$f":"MID(TEXT(CONTRIBUENTE!J43,\"gg/mm/aaaa\"),2,1)","v":"0"},null,{"$f":"MID(TEXT(CONTRIBUENTE!J43,\"gg/mm/aaaa\"),4,1)","v":"0"},null,{"$f":"MID(TEXT(CONTRIBUENTE!J43,\"gg/mm/aaaa\"),5,1)","v":"1"},{"$f":"MID(TEXT(CONTRIBUENTE!J43,\"gg/mm/aaaa\"),7,1)","v":"1"},{"$f":"MID(TEXT(CONTRIBUENTE!J43,\"gg/mm/aaaa\"),8,1)","v":"9"},{"$f":"MID(TEXT(CONTRIBUENTE!J43,\"gg/mm/aaaa\"),9,1)","v":"0"},{"$f":"MID(TEXT(CONTRIBUENTE!J43,\"gg/mm/aaaa\"),10,1)","v":"0"}]
[]
[null,null,null,{"$f":"VLOOKUP(CONTRIBUENTE!M43,CONTRIBUENTE!$E$148:$F$149,2,FALSE)","v":{"$error":"#N/A"}},null,null,null,null,null,null,{"$f":"CONTRIBUENTE!D45","v":0},null,null,null,null,null,null,null,null,null,null,null,null,null,null,null,{"$f":"LEFT(CONTRIBUENTE!H45,1)","v":""},{"$f":"RIGHT(CONTRIBUENTE!H45,1)","v":""},null,null,{"$f":"MID(CONTRIBUENTE!$J45,1,1)","v":""},{"$f":"MID(CONTRIBUENTE!$J45,2,1)","v":""},{"$f":"MID(CONTRIBUENTE!$J45,3,1)","v":""},{"$f":"MID(CONTRIBUENTE!$J45,4,1)","v":""},{"$f":"MID(CONTRIBUENTE!$J45,5,1)","v":""},{"$f":"MID(CONTRIBUENTE!$J45,6,1)","v":""},{"$f":"MID(CONTRIBUENTE!$J45,7,1)","v":""},{"$f":"MID(CONTRIBUENTE!$J45,8,1)","v":""},{"$f":"MID(CONTRIBUENTE!$J45,9,1)","v":""},{"$f":"MID(CONTRIBUENTE!$J45,10,1)","v":""},null,{"$f":"MID(CONTRIBUENTE!$J45,11,1)","v":""},null,{"$f":"MID(CONTRIBUENTE!$J45,12,1)","v":""},{"$f":"MID(CONTRIBUENTE!$J45,13,1)","v":""},{"$f":"MID(CONTRIBUENTE!$J45,14,1)","v":""},{"$f":"MID(CONTRIBUENTE!$J45,15,1)","v":""},{"$f":"MID(CONTRIBUENTE!$J45,16,1)","v":""}]
[]
{"$rows_left_out":36}
{"sheet":"Tabelle","index":3,"n_rows":87,"n_cols":21,"rows_kept":87,"cut":false,"hidden":false,"merged":[[81,16,81,19],[77,16,77,19],[78,16,78,19],[79,16,79,19],[30,1,30,12],[30,16,30,20],[31,16,31,20],[76,16,76,19],[72,16,72,19],[73,16,73,19],[70,16,70,19],[71,16,71,19],[64,16,64,19],[80,16,80,19],[65,16,65,19],[66,16,66,19],[67,16,67,19],[74,16,74,19],[75,16,75,19],[68,16,68,19],[69,16,69,19],[60,16,60,19],[61,16,61,19],[62,16,62,19],[63,16,63,19],[56,16,56,19],[57,16,57,19],[58,16,58,19],[59,16,59,19],[41,16,41,19],[42,16,42,19],[43,16,43,19],[52,16,52,19],[53,16,53,19],[54,16,54,19],[55,16,55,19],[48,16,48,19],[49,16,49,19],[50,16,50,19],[51,16,51,19],[71,1,71,12],[11,1,11,20],[80,1,80,12],[81,1,81,12],[31,13,31,14],[31,1,31,12],[76,1,76,12],[77,1,77,12],[78,1,78,12],[79,1,79,12],[72,1,72,12],[36,16,36,19],[37,16,37,19],[38,16,38,19],[39,16,39,19],[32,16,32,19],[33,16,33,19],[34,16,34,19],[35,16,35,19],[44,16,44,19],[45,16,45,19],[46,16,46,19],[47,16,47,19],[40,16,40,19],[80,13,80,14],[81,13,81,14],[52,1,52,12],[53,1,53,12],[54,1,54,12],[55,1,55,12],[56,1,56,12],[57,1,57,12],[58,1,58,12],[59,1,59,12],[64,1,64,12],[65,1,65,12],[66,1,66,12],[67,1,67,12],[60,1,60,12],[61,1,61,12],[62,1,62,12],[63,1,63,12],[73,1,73,12],[74,1,74,12],[75,1,75,12],[68,1,68,12],[69,1,69,12],[70,1,70,12],[71,13,71,14],[64,13,64,14],[65,13,65,14],[66,13,66,14],[67,13,67,14],[76,13,76,14],[77,13,77,14],[78,13,78,14],[79,13,79,14],[72,13,72,14],[73,13,73,14],[74,13,74,14],[75,13,75,14],[62,13,62,14],[63,13,63,14],[56,13,56,14],[57,13,57,14],[58,13,58,14],[59,13,59,14],[68,13,68,14],[69,13,69,14],[70,13,70,14],[53,13,53,14],[54,13,54,14],[55,13,55,14],[48,13,48,14],[49,13,49,14],[50,13,50,14],[51,13,51,14],[60,13,60,14],[61,13,61,14],[44,13,44,14],[45,13,45,14],[46,13,46,14],[47,13,47,14],[40,13,40,14],[41,13,41,14],[42,13,42,14],[43,13,43,14],[52,13,52,14],[48,1,48,12],[49,1,49,12],[50,1,50,12],[51,1,51,12],[44,1,44,12],[45,1,45,12],[46,1,46,12],[47,1,47,12],[36,1,36,12],[37,1,37,12],[38,1,38,12],[39,1,39,12],[17,8,17,9],[18,8,18,9],[40,1,40,12],[41,1,41,12],[42,1,42,12],[43,1,43,12],[12,10,12,19],[27,8,27,9],[27,10,27,19],[28,8,28,9],[28,10,28,19],[25,8,25,9],[32,1,32,12],[33,1,33,12],[34,1,34,12],[35,1,35,12],[36,13,36,14],[37,13,37,14],[38,13,38,14],[39,13,39,14],[32,13,32,14],[33,13,33,14],[34,13,34,14],[35,13,35,14],[25,10,25,19],[26,10,26,19],[19,10,19,19],[20,10,20,19],[21,10,21,19],[22,10,22,19],[26,8,26,9],[23,8,23,9],[24,8,24,9],[19,8,19,9],[15,1,15,5],[12,8,12,9],[13,8,13,9],[14,8,14,9],[15,8,15,9],[12,1,12,6],[13,1,13,5],[23,10,23,19],[24,10,24,19],[21,8,21,9],[22,8,22,9],[16,1,16,5],[17,1,17,5],[18,1,18,5],[19,1,19,5],[20,8,20,9],[14,1,14,5],[14,10,14,19],[13,10,13,19],[15,10,15,19],[16,10,16,19],[17,10,17,19],[18,10,18,19],[16,8,16,9],[5,8,5,12],[7,18,7,22],[7,15,7,17],[5,16,5,17],[5,18,5,22],[3,18,3,22],[4,18,4,22],[3,14,3,15],[2,2,2,7],[2,8,2,12],[2,14,2,15],[2,16,2,17],[5,14,5,15],[4,16,4,17],[3,16,3,17],[5,2,5,7],[3,8,3,12],[4,8,4,12],[4,14,4,15],[3,2,3,7],[4,2,4,7]]}
[]
[]
[null,"SIGLA","Delega irrevocabile a",null,null,null,null,null,"Agenzia",null,null,null,null,"Prov.","ABI",null,"CAB",null,"IBAN"]
[null,"B1","Nome Banca 1 / modifica sigla",null,null,null,null,null,"Nome Agenzia 1",null,null,null,null,"XX","00001",null,"10000",null,"IT12 A 12345 12345 123456789012"]
[null,"B2","Nome Banca 2 / modifica sigla",null,null,null,null,null,"Nome Agenzia 2",null,null,null,null,"XX","00002",null,"20000"]
[null,"B3","Nome Banca 3 / modifica sigla",null,null,null,null,null,"Nome Agenzia 3",null,null,null,null,"XX","00003",null,"30000"]
[]
[null,null,"Personalizza tutti i campi liberi.",null,null,null,null,null,null,null,null,null,null,null,null,"Sequenza IBAN:",null,null,"IT12 A 12345 12345 123456789012 = 31 carat."]
[]
[]
[]
[null,"Tabella CONTENZIOSO"]
[null,"Descrizione",null,null,null,null,null,null,"Ufficio",null,"CAUSALE",null,null,null,null,null,null,null,null,null,"COD."]
[null,"Commiss. tributaria prov.le",null,null,null,null,1,null,"ENTRATE",null,"IVA per acquisti intracomunitari (art.49 L.513/92)",null,null,null,null,null,null,null,null,null,"IN"]
[null,"Commiss. tributaria reg.le",null,null,null,null,2,null,"ENTRATE",null,"IVA per acquisti intra.i di mezzi di trasporto nuovi (art. 38 L.513/92)",null,null,null,null,null,null,null,null,null,"VT"]
[null,"Commiss. tributaria centrale",null,null,null,null,3,null,"ENTRATE",null,"Registrazione di atti giudiziari",null,null,null,null,null,null,null,null,null,"RG"]
[null,"Corte d’ Appello",null,null,null,null,4,null,"ENTRATE",null,"Registrazione di atti pubblici o privati",null,null,null,null,null,null,null,null,null,"RP"]
[null,"Corte di Cassazione",null,null,null,null,5,null,"ENTRATE",null,"Sanzioni pecuniarie in materia di imposte dirette ed indirette",null,null,null,null,null,null,null,null,null,"SZ"]
[null,"Conciliazione giudiziale",null,null,null,null,6,null,"ENTRATE",null,"Tributi autoliquidati collegati alla successione",null,null,null,null,null,null,null,null,null,"SA"]
[null,"---- Inserisci",null,null,null,null,".",null,"Territorio",null,"Certificazione ipotecaria",null,null,null,null,null,null,null,null,null,"CR"]
{"$rows_left_out":67}