{"text_format":"1","workbook":"xlsx","n_sheets":4,"sheets":["CONTRIBUENTE","DATI del VERSAMENTO","F 23","Tabelle"],"not_rendered":{"charts":0,"images":7,"macros":1,"external_links":0,"defined_names":6,"comments":0,"pivot_tables":0},"unopened":[],"bounds":{"document_bytes":16777216,"sheet_cells":100000,"rows_first":2000,"rows_last":500,"rows_between":2000,"halvings":0,"cell_chars":16384,"cell_head_chars":4096},"cells_cut":0,"cells_raw":0,"read":"whole","date_system":"1900"}

{"sheet":"CONTRIBUENTE","index":0,"n_rows":163,"n_cols":107,"rows_kept":163,"cut":false,"hidden":false,"merged":[[1,2,1,15],[2,2,2,15],[3,2,3,11],[5,2,5,15],[20,2,20,12],[11,19,11,20],[18,2,18,6],[19,2,19,6],[12,6,12,15],[15,2,15,8],[15,9,15,11],[17,2,17,6],[18,9,18,14],[17,9,17,14],[12,2,12,4],[16,2,16,7],[13,1,13,15],[14,1,14,15],[9,2,9,7],[9,9,9,12],[106,2,106,15],[107,2,107,15],[6,2,6,15],[71,2,71,6],[72,2,72,10],[33,2,33,3],[19,9,19,14],[29,2,29,14],[28,2,28,14],[53,2,53,14],[54,2,54,14],[25,12,25,15],[88,12,89,12],[89,4,89,6],[68,10,68,15],[72,11,72,15],[42,4,42,7],[42,9,42,10],[56,2,56,6],[76,2,76,15],[49,2,49,15],[80,2,80,15],[24,2,24,6],[31,2,31,3],[35,2,35,3],[26,9,26,15],[34,4,34,14],[33,4,33,12],[30,2,30,15],[35,4,35,7],[35,9,35,10],[110,1,110,7],[110,11,110,15],[109,2,109,15],[38,3,38,6],[50,2,50,15],[47,2,47,15],[51,2,51,15],[74,2,74,15],[70,1,70,15],[61,3,61,4],[105,2,105,15],[108,2,108,15],[60,5,60,15],[31,4,31,14],[103,2,103,15],[86,2,86,15],[104,2,104,15],[90,4,90,7],[102,2,102,12],[102,13,102,15],[100,2,100,15],[69,8,69,15],[67,10,67,15],[59,2,59,15],[65,5,65,15],[65,3,65,4],[75,2,75,15],[81,2,81,15],[82,12,82,15],[52,3,52,14],[37,3,37,6],[57,2,57,15],[38,9,38,12],[58,2,58,15],[85,8,85,10],[71,7,71,15],[63,10,63,15],[61,5,61,15],[36,4,36,7],[36,9,36,10],[37,9,37,12],[48,2,48,15],[43,4,43,7],[46,2,46,15],[43,9,43,10],[45,3,45,6],[45,9,45,12],[42,2,42,3],[44,3,44,6],[44,9,44,12],[40,2,40,3],[40,4,40,12],[41,4,41,14]]}
[]
[null,null,"Questo file contiene UNA MACRO (non indispensabile) nel foglio F23.  Puoi attivarla anche in un secondo momento, quando"]
[null,null,"riapri il file. Per utilizzarla assicurati di salvare il file nel formato con macro ATTIVE. Le macro sono COMANDI automatici che completano"]
[null,null,"le funzionalità di questo strumento, non contengono virus o altro.  Qui trovi la spiegazione di Microsoft:",null,null,null,null,null,null,null,null,null,"MACRO"]
[null,null,"Sistema interamente originale. Non necessita di aggiornamenti."]
[null,null,"di Marco Piccoli - P. IVA 01151800313"]
[null,null,"Monfalcone - GO - Tel. 333 46 39 497"]
[null,null,null,null,null,null,null,null,null,null,null,null,null,null,null,"Professionista Web di cui alla legge nr. 4/2013"]
[null,null,"Leggi attentamente questa presentazione, osserva le \"Note pratiche\" e richiedi liberamente informazioni via mail."]
[null,null,"Una copia di questo file è sempre disponibile al sito www.marcopiccoli.it:",null,null,null,null,null,null,"Area Download .xlsx / xlsm"]
[]
[null,null,"Puoi usare questo file per annotare i tuoi F23 di TUTTI i MESI di OGNI ANNO. Al momento il trimestre selezionato è:",null,null,null,null,null,null,null,null,null,null,null,null,null,null,null,null,"DAL  - GG/MM -  AL"]
[null,null,{"$f":"I86","v":"1° TRIMESTRE"},null,null,null,{"$f":"IF(J140=\"\",IF(E139=1,B136,\"\"),J140)","v":""},null,null,null,null,null,null,null,null,null,null,null,null,{"$f":"IF(I86=\"\",F159,VLOOKUP(I86,C159:G162,4,FALSE))","v":"2024-01-01"},{"$f":"IF(I86=\"\",G159,VLOOKUP(I86,C159:G162,5,FALSE))","v":"2024-03-31"}]
[null,"Questo strumento è liberamente utilizzabile DA TUTTI. Funziona integralmente per OGNI TRIMESTRE di ogni"]
[null,"ANNO. Puoi sbloccarlo in qualsiasi momento per l' INTERO ANNO. I valori che inserisci sono sempre disponibili."]
[null,null,{"$f":"IF(K68=J144,B127,B126)","v":"Richiedi via mail il TUO CODICE di PROPRIETA' per EXCEL:"},null,null,null,null,null,null,"info@marcopiccoli.it"]
[null,null,"Note pratiche:"]
[null,null,"USA IL TASTO - TAB - PER MUOVERE IL CURSORE NELLE",null,null,null,null,null,null,"USA IL TASTO - Canc - PER RIMUOVERE IL"]
[null,null,"CELLE LIBERE. TUTTE LE ALTRE SONO BLOCCATE E NON",null,null,null,null,null,null,"CONTENUTO DI UNA CELLA. PER MAC USA"]
[null,null,"TI SERVONO PER IL CORRETTO USO DI QUESTO FILE.",null,null,null,null,null,null,"- doppio tasto -   NON TAGLIARE LE CELLE."]
[]
[null,null,null,null,null,null,"per OpenOffice non disponibile"]
[]
[]
[null,null,"Il file contiene 1 Selettore MACRO."]
[null,null,null,null,null,null,null,null,null,null,null,null,"Questo è il sistema"]
[null,null,null,null,null,null,null,null,null,"F23 1.6 per Excel .xlsm"]
[]
[null,null,{"$f":"CONCATENATE(J27,\" è un sistema elettronico UNIVERSALE con il quale puoi creare e memorizzare molteplici modelli in 1 anno ed in più anni, identificandoli con\")","v":"F23 1.6 per Excel .xlsm è un sistema elettronico UNIVERSALE con il quale puoi creare e memorizzare molteplici modelli in 1 anno ed in più anni, identificandoli con"}]
[null,null,"1 numero di protocollo progressivo."]
[null,null,"Il documento si edita una riga sotto l' altra progressivamente e si stampa a scelta nel foglio del  \\ MODELLO Elettronico /."]
[null,null,"CONTRIBUENTE"]
[]
[null,null,"Dati Anagrafici",null,"Anagrafica CONTRIBUENTE"]
[null,null,"4.",null,"Cognome, denominazione o ragione sociale"]
[null,null,null,null,"Nome CONTRIBUENTE",null,null,null,null,"2000-01-01"]
[null,null,null,null,"Nome",null,null,null,null,"Data di nascita",null,null,"Sesso"]
[null,null,null,null,null,null,null,null,null,"01234567891"]
[null,null,null,"Comune (o Stato estero) di nascita",null,null,null,"Prov",null,"CODICE FISCALE"]
[]
[null,null,"Dati Anagrafici"]
[null,null,"5.",null,"Cognome, denominazione o ragione sociale"]
[]
[null,null,null,null,"Nome",null,null,null,null,"Data di nascita",null,null,"Sesso"]
[]
[null,null,null,"Comune (o Stato estero) di nascita",null,null,null,"Prov",null,"CODICE FISCALE"]
[null,null,"Dopo aver compilato il quadro CONTRIBUENTE, utilizza il foglio  \\ DATI del VERSAMENTO /"]
[null,null,"per generare i tuoi singoli documenti inserendo gli elementi specifici riga per riga."]
[null,null,"Assegna:  1 numero di protocollo progressivo  per creare ogni singolo documento.   Stesso nr. di prot. =  stesso DOC."]
[]
[null,null,{"$f":"IF(H138=1,G13,IF(ISERROR(K138),J135,J134))","v":"Questo file risulta al momento completamente funzionante ed il sistema rileva tutti i suoi fogli."}]
[]
[null,null,"Note:"]
[]
[]
[]
[null,null,"PROPRIETA' illimitata del file"]
[null,null,"Questo sistema può funzionare in enne copie rinominate a piacere. Funziona con calendario PERPETUO."]
[null,null,"Per attivarlo nella totalità dell' ANNO inserisci in qualsiasi momento il tuo codice di proprietà nell' apposito spazio. Puoi"]
[null,null,"usare contemporaneamente più di un file. Salva un file IN BIANCO con le tue IMPOSTAZIONI da tenere come MATRICE."]
[null,null,null,null,null,{"$f":"IF(K68=J144,B136,\"\")","v":""}]
[null,null,null,"Anagrafica:",null,{"$f":"E34","v":"Anagrafica CONTRIBUENTE"}]
[]
[null,null,null,null,null,null,null,null,null,"Partita IVA / C.F:",{"$f":"J38","v":"01234567891"}]
[]
[null,null,null,"Indirizzo:"]
[]
[null,null,"QUI",null,null,null,null,null,null,"Inserisci qui il tuo codice di proprietà  --->",null,null,null,null,null,null,{"$f":"IF(ISBLANK(K68),0,1)","v":0}]
[null,null,{"$f":"IF(K68=$J$144,\"ora è disattivato\",\"cambi trimestre\")","v":"cambi trimestre"}]
[null,null,{"$f":"C154","v":89},"giorni al","primo mese disattivato",null,null,null,{"$f":"IF(K68=\"\",\"\",IF(J144=K68,B134,B135))","v":""},null,null,null,null,null,null,null,null,null,{"$f":"IF(K68=J144,J130,H126)","v":"Il codice che hai inserito nel sistema non è stato riconosciuto."}]
[null,{"$f":"IF(K68=J144,B130,IF(I70=B135,B131,IF(C70<0,\"\",\"\")))","v":""},null,null,null,null,null,null,null,null,null,null,null,null,null,null,null,null,{"$f":"IF(K68=J144,J131,H127)","v":"Le cause possono essere le seguenti:"}]
[null,null,"PREZZO per 1 codice di proprietà € 39,00",null,null,null,null,"Questo sistema utilizza il codice ID: Contabilità #2"]
[null,null,{"$f":"J27","v":"F23 1.6 per Excel .xlsm"},null,null,null,null,null,null,null,null,"www.marcopiccoli.it",null,null,null,null,null,null,"1) La Ragione Sociale inserita non coincide con il testo in mio possesso."]
[null,null,null,null,null,null,null,null,null,null,null,null,null,null,null,null,null,null,"Verifica la punteggiatura e l' assenza di spazi iniziali / finali. Controlla la P.E.C. ricevuta."]
[null,null,"Questo file funziona solo se lasciato integro in tutte le sue parti. E' garantito il funzionamento con PC - Excel .xls o sup.",null,null,null,null,null,null,null,null,null,null,null,null,null,null,null,"2) La Partita IVA inserita non coincide con il numero in mio possesso."]
[null,null,"Il sistema conta 4 fogli compreso il presente. I fogli NON POSSONO ESSERE ELIMINATI altrimenti l' intero sistema",null,null,null,null,null,null,null,null,null,null,null,null,null,null,null,"3) Il codice che ti ho fornito non è stato correttamente inserito."]
[null,null,"non funzionerà. Se succede involontariamente NON SALVARE IL FILE ma chiudilo e riaprilo nuovamente.",null,null,null,null,null,null,null,null,null,null,null,null,null,null,null,"4) Hai inserito un numero a caso?"]
[null,null,null,"Pagina WEB del sistema",null,null,"Sezione info",null,null,null,"I tuoi",null,null,null,null,null,null,null,"Contattami liberamente via mail in qualsiasi momento per ulteriori informazioni sul codice."]
[null,null,null,"QUI",null,null,"F.A.Q.","About me",null,null,"COMMENTI",null,null,null,null,null,null,null,"5) Hai cambiato Ragione Sociale o Partita IVA? Contattami, il codice è una monoutenza specifica."]
[null,null,null,null,null,null,null,null,null,null,null,null,null,null,null,null,null,null,"6) Hai usato il codice di un altro sistema? Non tutti i sistemi hanno lo stesso codice."]
[null,null,"Se desideri attivare questo sistema per l' INTERO ANNO e per OGNI ANNO, richiedi via mail il tuo Codice di Proprietà ed",null,null,null,null,null,null,null,null,null,null,null,null,null,null,null,"Questo file utilizza il codice di proprietà ID: Contabilità #2."]
[null,null,"inseriscilo direttamente nel file che stai già usando. Il codice ti viene inviato con regolare fattura. Chiedi istruzioni via mail."]
[null,null,null,null,null,null,null,null,null,null,null,null,"info@marcopiccoli.it",null,null,null,null,null,"Per qualsiasi altra cosa, contattami dopo aver considerato questi punti."]
[null,null,null,"SELEZIONA da qui il TRIMESTRE per il quale ATTIVARE questo sistema."]
[null,null,null,"I valori che via via inserisci sono sempre disponibili."]
[null,null,null,null,null,null,null,"---->","1° TRIMESTRE"]
[]
[]
[null,null,null,null,null,null,null,null,null,null,null,"Con  \"OK\"  accetti le regole","OK"]
[null,null,null,null,"A.C. cell di Marco Piccoli",null,null,null,null,null,null,"sull' utilizzo di questo file"]
[null,null,null,null,"34074 Monfalcone, GO - P. IVA 01151800313"]
[null,null,null,null,"INFORMA CHIUNQUE ENTRI IN POSSESSO DI QUESTO FILE, CHE NON E'"]
[null,null,null,null,"POSSIBILE UTILIZZARLO SENZA PROTEZIONI ORIGINALI e CHE SI ATTIVA"]
[null,null,null,null,"ILLIMITATAMENTE SOLO CON REGOLARE CODICE DI PROPRIETA'."]
[null,null,null,null,"Questo strumento è interamente originale ed è distribuito professionalmente."]
[null,null,null,null,"E' coperto da diritti d' autore dal momento della sua pubblicazione sul sito"]
[null,null,null,null,"www.marcopiccoli.it."]
[null,null,null,null,"L' inserimento del Codice di Proprietà, che viene inviato via P.E.C., estende tutti"]
[null,null,null,null,"i diritti anche al Titolare del Sistema individuato nell' ANAGRAFICA di questo file.",null,null,null,null,null,null,null,null,null,"QUI"]
[null,null,null,null,"Per qualsiasi altra informazione contattami liberamente via mail."]
[]
[]
[null,null,{"$f":"CONCATENATE(J27,\"   /   Sistema originale, nessuna riproduzione è permessa.\")","v":"F23 1.6 per Excel .xlsm   /   Sistema originale, nessuna riproduzione è permessa."}]
[null,null,"Rimuovere le protezioni originali, far circolare una parte del sistema o qualsiasi altro utilizzo (anche parziale, anche dei"]
[null,null,"testi, anche a titolo gratuito) diverso dalle disposizioni originarie del file, sarà considerata violazione delle norme sulle"]
[null,null,"opere d' ingegno. Il sistema originale privo di virus e malware si scarica al sito www.marcopiccoli.it."]
[]
[]
[null,null,null,null,null,null,null,null,null,null,null,null,null,null,null,null,null,"Torna su"]
[]
[null,{"$f":"J27","v":"F23 1.6 per Excel .xlsm"},null,null,null,null,null,null,null,null,null,"www.marcopiccoli.it"]
[]
[]
[]
[]
[null,null,null,"X","Maschile","M"]
[null,null,null,null,"Femminile","F"]
[]
[]
[]
[]
[]
[]
[]
[]
[null,"Richiedi via mail il TUO CODICE di PROPRIETA' per EXCEL:",null,null,null,null,null,"Il codice che hai inserito nel sistema non è stato riconosciuto."]
[null,"Contatta A.C. cell",null,null,null,null,null,"Le cause possono essere le seguenti:"]
[null,"Questo file contiene delle MACRO. Leggi le istruzioni e completa il foglio  \\ IMPOSTAZIONI /  prima di utilizzare il file."]
[null,"Questo file contiene delle MACRO.",null,null,null,null,null,null,null,null,"disattivato"]
[null,"Questo sistema appartiene al TITOLARE in anagrafica. Qualsiasi altro uso non è permesso.",null,null,null,null,null,null,null,"Questo file si considera funzionante al momento della richiesta del codice."]
[null,"Verifica le NOTE che trovi a fondo pagina.",null,null,null,null,null,null,null,"Tieni costantemente una copia di sicurezza ed una MATRICE in bianco per gli anni successivi."]
[]
[]
[null,"OK ! Codice corretto.",null,null,"OK","Sistema scaduto",null,null,null,"Questo file risulta al momento completamente funzionante ed il sistema rileva tutti i suoi fogli."]
[null,"CODICE NON VALIDO",null,null,"NO",{"$f":"IF(M89=E134,TRUE,FALSE)","v":true},null,null,null,"SISTEMA DANNEGGIATO !!! Chiudere senza salvare!"]
[null,"TITOLARE DEL SISTEMA",null,null,null,null,null,null,null,{"$f":"IF(C154=0,\"Sistema parzialmente attivato. Inserisci il tuo CODICE di PROPRIETA' nel foglio Presentazione.\",CONCATENATE(\"Sistema attivato dal \",TEXT(T13,\"GG/MM\"),\" al \",TEXT(U13,\"GG/MM\"),\". Modifica il trimestre dal foglio Presentazione.\"))","v":"Sistema attivato dal 01/01 al 31/03. Modifica il trimestre dal foglio Presentazione."}]
[]
[null,1,"BIT INTEGRITA'",null,{"$f":"IF(AND(F135=TRUE,K68=J144),1,0)","v":0},"PROPRIETA'",null,{"$f":"IF(G13=F134,1,IF(F135=FALSE,1,0))","v":0},"SCADENZA",null,{"$f":"B138+'DATI del VERSAMENTO'!L1019+'F 23'!AR55+Tabelle!B87","v":4},"INTEGRITA'"]
[null,null,null,null,{"$f":"IF(K68=J144,1,0)","v":0},"PROPRIETA'"]
[null,null,null,null,null,null,null,null,null,{"$f":"IF(F135=FALSE,\"ERRORE: manca l' OK sulle regole di utilizzo del file.\",IF(K68=J144,\"\",IF(C70<0,F134,\"\")))","v":""}]
[]
[null,"Nome del Titolare",null,null,null,null,"P. IVA o Cod. Fiscale",null,null,null,null,null,1,2,3,4,5,6,7,8,9,10,11,null,null,{"$f":"M144","v":0},{"$f":"ROUND((Z142+AC142)*3,1)","v":3},61,{"$f":"N144","v":1},{"$f":"ROUND((AC142+AF142)*3,1)","v":9},{"$f":"AB142-5","v":56},{"$f":"O144","v":2},{"$f":"ROUND((AF142+AI142)*3,1)","v":15},{"$f":"AE142-5","v":51},{"$f":"P144","v":3},{"$f":"ROUND((AI142+AL142)*3,1)","v":21},{"$f":"AH142-5","v":46},{"$f":"Q144","v":4},{"$f":"ROUND((AL142+AO142)*3,1)","v":27},{"$f":"AK142-5","v":41},{"$f":"R144","v":5},{"$f":"ROUND((AO142+AR142)*3,1)","v":33},{"$f":"AN142-5","v":36},{"$f":"S144","v":6},{"$f":"ROUND((AR142+AU142)*3,1)","v":39},{"$f":"AQ142-5","v":31},{"$f":"T144","v":7},{"$f":"ROUND((AU142+AX142)*3,1)","v":45},{"$f":"AT142-5","v":26},{"$f":"U144","v":8},{"$f":"ROUND((AX142+BA142)*3,1)","v":51},{"$f":"AW142-5","v":21},{"$f":"V144","v":9},{"$f":"ROUND((BA142+BD142)*3,1)","v":30},{"$f":"AZ142-5","v":16},{"$f":"W144","v":1},{"$f":"ROUND((BD142+Z142)*3,1)","v":3},{"$f":"BC142-5","v":11},null,null,"A","B","C","D","F","E","I","G","H","K","J","N","L","M","P","O","S","Q","R","U","T","X","V","W","Z","Y","ù","à","è","ì","ò","/","","\"","-",".","3","1","2","5","4","8","6","7","0","9"," "]
[]
[null,{"$f":"E34","v":"Anagrafica CONTRIBUENTE"},null,null,null,null,{"$f":"J38","v":"01234567891"},null,null,{"$f":"CONCATENATE(J148,\"-\",J149,\"-\",J150)","v":"223-BKBCC-823"},null,null,{"$f":"IF(ISERROR(VALUE(MID($G144,M142,1))),M142,IF(M142<($H145+1),VALUE(MID($G144,M142,1)),0))","v":0},1,2,3,4,5,6,7,8,9,1,null,null,{"$f":"HLOOKUP(MID($B144,Z142,1),$BI142:$DC144,3,FALSE)","v":{"$error":"#VALUE!"}},1,33,1,3,33,12,21,33,1,12,33,8,33,33,19,33,33,1,33,33,5,33,33,7,33,12,3,33,19,1,1,47,null,null,1,2,3,4,5,6,7,8,9,10,11,12,13,14,15,16,17,18,19,20,21,22,23,24,25,26,27,28,29,30,31,32,33,34,35,36,37,38,39,40,41,42,43,44,45,46,47]
[null,null,null,null,null,null,"LUNG. Txt",{"$f":"LEN(G144)","v":11},null,null,null,null,null,null,null,null,null,null,null,null,null,null,null,null,null,null,null,null,null,null,null,null,null,null,null,null,null,null,null,null,null,null,null,null,null,null,null,null,null,null,null,null,null,null,null,null,null,null,null,null,"A","B","C","D","E","F","G","H","I","J","K","L","M","N","O","P","Q","R","S","T","U","V","W","X","Y","Z",null,null,null,null,null,null,null,null,null,null,{"$f":"COUNTIF($Z142:$BF142,CS142)","v":3},2,1,1,1,1,1,1,1,2," "]
[null,12,null,null,null,null,null,null,null,null,null,null,null,null,null,null,null,null,null,null,null,null,null,{"$f":"IF(X149<0,X149*-1,X149)","v":227},null,null,null,null,null,null,null,null,null,null,null,null,null,null,null,null,null,null,null,null,null,null,null,null,null,null,null,null,null,null,null,null,null,null,{"$f":"IF(BG149<0,BG149*-1,BG149)","v":3734},null,null,null,null,null,null,null,null,null,null,null,null,null,null,null,null,null,null,null,null,null,null,null,null,null,null,null,null,null,null,null,null,null,null,null,15,null,{"$f":"IF(ISERROR(HLOOKUP(SMALL($Z142:$BF142,CS142),$BI144:$CH145,2,FALSE)),HLOOKUP(SMALL($Z142:$BF142,CS142),$BI144:$CH145,2,TRUE),HLOOKUP(SMALL($Z142:$BF142,CS142),$BI144:$CH145,2,FALSE))","v":"A"},{"$f":"IF(ISERROR(HLOOKUP(SMALL($Z142:$BF142,CT142+SUM($CS145:CS145)),$BI144:$CH145,2,FALSE)),HLOOKUP(SMALL($Z142:$BF142,CT142+SUM($CS145:CS145)),$BI144:$CH145,2,TRUE),HLOOKUP(SMALL($Z142:$BF142,CT142+SUM($CS145:CS145)),$BI144:$CH145,2,FALSE))","v":"B"},{"$f":"IF(ISERROR(HLOOKUP(SMALL($Z142:$BF142,CU142+SUM($CS145:CT145)),$BI144:$CH145,2,FALSE)),HLOOKUP(SMALL($Z142:$BF142,CU142+SUM($CS145:CT145)),$BI144:$CH145,2,TRUE),HLOOKUP(SMALL($Z142:$BF142,CU142+SUM($CS145:CT145)),$BI144:$CH145,2,FALSE))","v":"C"},{"$f":"IF(ISERROR(HLOOKUP(SMALL($Z142:$BF142,CV142+SUM($CS145:CU145)),$BI144:$CH145,2,FALSE)),HLOOKUP(SMALL($Z142:$BF142,CV142+SUM($CS145:CU145)),$BI144:$CH145,2,TRUE),HLOOKUP(SMALL($Z142:$BF142,CV142+SUM($CS145:CU145)),$BI144:$CH145,2,FALSE))","v":"G"},{"$f":"IF(ISERROR(HLOOKUP(SMALL($Z142:$BF142,CW142+SUM($CS145:CV145)),$BI144:$CH145,2,FALSE)),HLOOKUP(SMALL($Z142:$BF142,CW142+SUM($CS145:CV145)),$BI144:$CH145,2,TRUE),HLOOKUP(SMALL($Z142:$BF142,CW142+SUM($CS145:CV145)),$BI144:$CH145,2,FALSE))","v":"G"},{"$f":"IF(ISERROR(HLOOKUP(SMALL($Z142:$BF142,CX142+SUM($CS145:CW145)),$BI144:$CH145,2,FALSE)),HLOOKUP(SMALL($Z142:$BF142,CX142+SUM($CS145:CW145)),$BI144:$CH145,2,TRUE),HLOOKUP(SMALL($Z142:$BF142,CX142+SUM($CS145:CW145)),$BI144:$CH145,2,FALSE))","v":"O"},{"$f":"IF(ISERROR(HLOOKUP(SMALL($Z142:$BF142,CY142+SUM($CS145:CX145)),$BI144:$CH145,2,FALSE)),HLOOKUP(SMALL($Z142:$BF142,CY142+SUM($CS145:CX145)),$BI144:$CH145,2,TRUE),HLOOKUP(SMALL($Z142:$BF142,CY142+SUM($CS145:CX145)),$BI144:$CH145,2,FALSE))","v":"K"},{"$f":"IF(ISERROR(HLOOKUP(SMALL($Z142:$BF142,CZ142+SUM($CS145:CY145)),$BI144:$CH145,2,FALSE)),HLOOKUP(SMALL($Z142:$BF142,CZ142+SUM($CS145:CY145)),$BI144:$CH145,2,TRUE),HLOOKUP(SMALL($Z142:$BF142,CZ142+SUM($CS145:CY145)),$BI144:$CH145,2,FALSE))","v":"P"},{"$f":"IF(ISERROR(HLOOKUP(SMALL($Z142:$BF142,DA142+SUM($CS145:CZ145)),$BI144:$CH145,2,FALSE)),HLOOKUP(SMALL($Z142:$BF142,DA142+SUM($CS145:CZ145)),$BI144:$CH145,2,TRUE),HLOOKUP(SMALL($Z142:$BF142,DA142+SUM($CS145:CZ145)),$BI144:$CH145,2,FALSE))","v":"G"},{"$f":"IF(ISERROR(HLOOKUP(SMALL($Z142:$BF142,CQ146),$BI144:$CH145,2,FALSE)),HLOOKUP(SMALL($Z142:$BF142,CQ146),$BI144:$CH145,2,TRUE),HLOOKUP(SMALL($Z142:$BF142,CQ146),$BI144:$CH145,2,FALSE))","v":"K"}]
[null,null,null,null,null,null,null,null,null,null,null,null,{"$f":"M144*$B146","v":0},null,{"$f":"O144*$B146","v":24},null,{"$f":"Q144*$B146","v":48},null,{"$f":"S144*$B146","v":72},null,{"$f":"U144*$B146","v":96},null,{"$f":"W144*$B146","v":12},{"$f":"IF(X150<0,X150*-1,X150)","v":280},null,{"$f":"Z144*$B146","v":{"$error":"#VALUE!"}},null,{"$f":"AB144*$B146","v":396},null,{"$f":"AD144*$B146","v":36},null,{"$f":"AF144*$B146","v":144},null,{"$f":"AH144*$B146","v":396},null,{"$f":"AJ144*$B146","v":144},null,{"$f":"AL144*$B146","v":96},null,{"$f":"AN144*$B146","v":396},null,{"$f":"AP144*$B146","v":396},null,{"$f":"AR144*$B146","v":12},null,{"$f":"AT144*$B146","v":396},null,{"$f":"AV144*$B146","v":396},null,{"$f":"AX144*$B146","v":84},null,{"$f":"AZ144*$B146","v":144},null,{"$f":"BB144*$B146","v":396},null,{"$f":"BD144*$B146","v":12},null,{"$f":"BF144*$B146","v":564},{"$f":"IF(BG150<0,BG150*-1,BG150)","v":3346},null,null,null,null,null,null,null,null,null,null,null,null,null,null,null,null,null,null,null,null,null,null,null,null,null,null,null,null,null,null,null,null,null,null,null,null,null,{"$f":"IF(ISERROR(CS146),0,CS146)","v":"A"},"B","C","G","G","O","K","P","G","K"]
[null,null,null,"X","Maschile","M",null,null,null,{"$f":"CONCATENATE(AE153,AF153,AG153)","v":"223"},null,null,null,{"$f":"N144*$B146","v":12},null,{"$f":"P144*$B146","v":36},null,{"$f":"R144*$B146","v":60},null,{"$f":"T144*$B146","v":84},null,{"$f":"V144*$B146","v":108},null,{"$f":"IF(X151<0,X151*-1,X151)","v":1105},null,null,{"$f":"AA144*$B146","v":12},null,{"$f":"AC144*$B146","v":12},null,{"$f":"AE144*$B146","v":396},null,{"$f":"AG144*$B146","v":252},null,{"$f":"AI144*$B146","v":12},null,{"$f":"AK144*$B146","v":396},null,{"$f":"AM144*$B146","v":396},null,{"$f":"AO144*$B146","v":228},null,{"$f":"AQ144*$B146","v":396},null,{"$f":"AS144*$B146","v":396},null,{"$f":"AU144*$B146","v":60},null,{"$f":"AW144*$B146","v":396},null,{"$f":"AY144*$B146","v":396},null,{"$f":"BA144*$B146","v":36},null,{"$f":"BC144*$B146","v":228},null,{"$f":"BE144*$B146","v":12},null,{"$f":"IF(BG151<0,BG151*-1,BG151)","v":15302}]
[null,null,null,null,"Femminile","F",null,null,null,{"$f":"CONCATENATE(R153,S153,T153,U153,V153)","v":"BKBCC"},null,null,{"$f":"M147-N144","v":-1},null,{"$f":"O147-P144","v":21},null,{"$f":"Q147-R144","v":43},null,{"$f":"S147-T144","v":65},null,{"$f":"U147-V144","v":87},null,{"$f":"W147-M144","v":12},{"$f":"SUM(M149:W149)","v":227},null,{"$f":"Z147-BF144","v":{"$error":"#VALUE!"}},null,{"$f":"AB147-AA144","v":395},null,{"$f":"AD147-AC144","v":35},null,{"$f":"AF147-AE144","v":111},null,{"$f":"AH147-AG144","v":375},null,{"$f":"AJ147-AI144","v":143},null,{"$f":"AL147-AK144","v":63},null,{"$f":"AN147-AM144","v":363},null,{"$f":"AP147-AO144","v":377},null,{"$f":"AR147-AQ144","v":-21},null,{"$f":"AT147-AS144","v":363},null,{"$f":"AV147-AU144","v":391},null,{"$f":"AX147-AW144","v":51},null,{"$f":"AZ147-AY144","v":111},null,{"$f":"BB147-BA144","v":393},null,{"$f":"BD147-BC144","v":-7},null,{"$f":"BF147-BE144","v":563},{"$f":"SUMIF(Z149:BF149,\">0\")","v":3734},null,null,null,null,null,null,null,null,null,null,null,null,null,null,null,null,null,null,null,null,null,null,null,null,null,null,null,null,null,null,null,null,null,null,null,null,null,"A","D","E","G","O","P","R","R","S","U"]
[null,null,null,null,null,null,null,null,null,{"$f":"CONCATENATE(AH153,AI153,AJ153)","v":"823"},null,null,null,{"$f":"N148-M144","v":12},null,{"$f":"P148-O144","v":34},null,{"$f":"R148-Q144","v":56},null,{"$f":"T148-S144","v":78},null,{"$f":"V148-U144","v":100},null,{"$f":"SUM(M150:W150)","v":280},null,null,{"$f":"AA148-AB144","v":-21},null,{"$f":"AC148-AD144","v":9},null,{"$f":"AE148-AF144","v":384},null,{"$f":"AG148-AH144","v":219},null,{"$f":"AI148-AJ144","v":0},null,{"$f":"AK148-AL144","v":388},null,{"$f":"AM148-AN144","v":363},null,{"$f":"AO148-AP144","v":195},null,{"$f":"AQ148-AR144","v":395},null,{"$f":"AS148-AT144","v":363},null,{"$f":"AU148-AV144","v":27},null,{"$f":"AW148-AX144","v":389},null,{"$f":"AY148-AZ144","v":384},null,{"$f":"BA148-BB144","v":3},null,{"$f":"BC148-BD144","v":227},null,{"$f":"BE148-BF144","v":-35},null,{"$f":"SUMIF(Z150:BF150,\">0\")","v":3346},null,null,null,null,null,null,null,null,null,null,null,null,null,null,null,null,null,null,null,null,null,null,null,null,null,null,null,null,null,null,null,null,null,null,null,null,null,{"$f":"IF(CS147=0,CS149,CS146)","v":"A"},"B","C","G","G","O","K","P","G","K"]
[null,{"$f":"DAY(E151)","v":31},{"$f":"MONTH(E151)","v":3},{"$f":"YEAR(E151)","v":2024},{"$f":"U13","v":45382},null,null,null,null,null,null,null,{"$f":"M144+M147+M149","v":-1},{"$f":"N144+N148+N150","v":25},{"$f":"O144+O147+O149","v":47},{"$f":"P144+P148+P150","v":73},{"$f":"Q144+Q147+Q149","v":95},{"$f":"R144+R148+R150","v":121},{"$f":"S144+S147+S149","v":143},{"$f":"T144+T148+T150","v":169},{"$f":"U144+U147+U149","v":191},{"$f":"V144+V148+V150","v":217},{"$f":"W144+W147+W149","v":25},{"$f":"SUM(M151:W151)","v":1105},null,{"$f":"Z144+Z147+Z149","v":{"$error":"#VALUE!"}},{"$f":"AA144+AA148+AA150","v":-8},{"$f":"AB144+AB147+AB149","v":824},{"$f":"AC144+AC148+AC150","v":22},{"$f":"AD144+AD147+AD149","v":74},{"$f":"AE144+AE148+AE150","v":813},{"$f":"AF144+AF147+AF149","v":267},{"$f":"AG144+AG148+AG150","v":492},{"$f":"AH144+AH147+AH149","v":804},{"$f":"AI144+AI148+AI150","v":13},{"$f":"AJ144+AJ147+AJ149","v":299},{"$f":"AK144+AK148+AK150","v":817},{"$f":"AL144+AL147+AL149","v":167},{"$f":"AM144+AM148+AM150","v":792},{"$f":"AN144+AN147+AN149","v":792},{"$f":"AO144+AO148+AO150","v":442},{"$f":"AP144+AP147+AP149","v":806},{"$f":"AQ144+AQ148+AQ150","v":824},{"$f":"AR144+AR147+AR149","v":-8},{"$f":"AS144+AS148+AS150","v":792},{"$f":"AT144+AT147+AT149","v":792},{"$f":"AU144+AU148+AU150","v":92},{"$f":"AV144+AV147+AV149","v":820},{"$f":"AW144+AW148+AW150","v":818},{"$f":"AX144+AX147+AX149","v":142},{"$f":"AY144+AY148+AY150","v":813},{"$f":"AZ144+AZ147+AZ149","v":267},{"$f":"BA144+BA148+BA150","v":42},{"$f":"BB144+BB147+BB149","v":822},{"$f":"BC144+BC148+BC150","v":474},{"$f":"BD144+BD147+BD149","v":6},{"$f":"BE144+BE148+BE150","v":-22},{"$f":"BF144+BF147+BF149","v":1174},{"$f":"SUMIF(Z151:BF151,\">0\")","v":15302}]
[null,{"$f":"DAY(E152)","v":2},{"$f":"MONTH(E152)","v":1},{"$f":"YEAR(E151)","v":2024},{"$f":"TODAY()","v":45293}]
[null,null,null,null,null,null,null,null,null,null,null,null,{"$f":"SUM(X149:X151)","v":1612},null,null,null,{"$f":"LEN(TEXT(M153,\"@\"))","v":4},{"$f":"IF(Q153>0,HLOOKUP(MID(TEXT($M153,\"@\"),1,1),$CS142:$DB150,9,FALSE),\"\")","v":"B"},{"$f":"IF($Q153>1,HLOOKUP(MID(TEXT($M153,\"@\"),2,1),$CS142:$DB150,9,FALSE),HLOOKUP(MID(TEXT($X153,\"@\"),1,1),$CS142:$DB150,9,FALSE))","v":"K"},{"$f":"IF($Q153>2,HLOOKUP(MID(TEXT($M153,\"@\"),3,1),$CS142:$DB150,9,FALSE),HLOOKUP(MID(TEXT($X153,\"@\"),2,1),$CS142:$DB150,9,FALSE))","v":"B"},{"$f":"IF($Q153>3,HLOOKUP(MID(TEXT($M153,\"@\"),4,1),$CS142:$DB150,9,FALSE),HLOOKUP(MID(TEXT($X153,\"@\"),3,1),$CS142:$DB150,9,FALSE))","v":"C"},{"$f":"IF($Q153>4,HLOOKUP(MID(TEXT($M153,\"@\"),5,1),$CS142:$DB150,9,FALSE),HLOOKUP(MID(TEXT($X153,\"@\"),4,1),$CS142:$DB150,9,FALSE))","v":"C"},{"$f":"LEN(TEXT(CONCATENATE(TEXT(X146,\"@\"),TEXT(X147,\"@\"),TEXT(X148,\"@\")),\"@\"))","v":10},{"$f":"IF(W153<4,CONCATENATE(TEXT(CQ146,\"@\"),TEXT(X146,\"@\"),TEXT(X147,\"@\"),TEXT(X148,\"@\")),CONCATENATE(TEXT(X146,\"@\"),TEXT(X147,\"@\"),TEXT(X148,\"@\")))","v":"2272801105"},null,{"$f":"SUM(BG149:BG151)","v":22382},null,null,null,{"$f":"LEN(TEXT(Z153,\"@\"))","v":5},{"$f":"IF(AD153>0,MID(TEXT($Z153,\"@\"),1,1),\"\")","v":"2"},{"$f":"IF($AD153>1,MID(TEXT($Z153,\"@\"),2,1),MID(TEXT($BG153,\"@\"),1,1))","v":"2"},{"$f":"IF($AD153>2,MID(TEXT($Z153,\"@\"),3,1),MID(TEXT($BG153,\"@\"),2,1))","v":"3"},{"$f":"IF($AD153>3,MID(TEXT($Z153,\"@\"),4,1),MID(TEXT($BG153,\"@\"),3,1))","v":"8"},{"$f":"IF($AD153>4,MID(TEXT($Z153,\"@\"),5,1),MID(TEXT($BG153,\"@\"),4,1))","v":"2"},{"$f":"IF($AD153>5,MID(TEXT($Z153,\"@\"),6,1),MID(TEXT($BG153,\"@\"),5,1))","v":"3"},{"$f":"LEN(TEXT(CONCATENATE(TEXT(BG146,\"@\"),TEXT(BG147,\"@\")),\"@\"))","v":8},null,null,null,null,null,null,null,null,null,null,null,null,null,null,null,null,null,null,null,null,null,{"$f":"IF(AK153<5,CONCATENATE(TEXT(BG148,\"@\"),TEXT(BG146,\"@\"),TEXT(BG147,\"@\")),CONCATENATE(TEXT(BG146,\"@\"),TEXT(BG147,\"@\")))","v":"37343346"}]
[null,{"$f":"DATE(D151,C151,B151)","v":45382},{"$f":"IF((B154-B155)<0,0,B154-B155)","v":89}]
[null,{"$f":"DATE(D152,C152,B152)","v":45293}]
[]
[]
[null,null,null,null,null,"ANNO",{"$f":"'F 23'!AX3","v":2024}]
[null,null,"1° TRIMESTRE",null,1,{"$f":"DATE(G158,E159,1)","v":"2024-01-01"},{"$f":"F160-1","v":"2024-03-31"}]
[null,null,"2° TRIMESTRE",null,4,{"$f":"DATE(G158,E160,1)","v":"2024-04-01"},{"$f":"F161-1","v":"2024-06-30"}]
[null,null,"3° TRIMESTRE",null,7,{"$f":"DATE(G158,E161,1)","v":"2024-07-01"},{"$f":"F162-1","v":"2024-09-30"}]
[null,null,"4° TRIMESTRE",null,10,{"$f":"DATE(G158,E162,1)","v":"2024-10-01"},{"$f":"DATE(G158,E163,31)","v":"2024-12-31"}]
[null,null,null,null,12]

{"sheet":"DATI del VERSAMENTO","index":1,"n_rows":1068,"n_cols":33,"rows_kept":1068,"cut":false,"hidden":false,"merged":[[3,3,3,4],[5,4,6,4],[1009,3,1009,4],[4,3,4,4],[1,9,1,18],[2,9,2,12],[3,9,3,10],[1,3,1,4],[2,3,2,4],[5,28,6,28],[5,17,5,18],[4,20,4,22],[5,20,5,22],[1010,3,1010,4]]}
[]
[null,null,null,"Contribuente:",null,null,null,null,null,"Compila le righe di questa sezione una sotto l' altra, assegnando un numero di protocollo progressivo e la data in ogni riga."]
[null,null,null,{"$f":"CONTRIBUENTE!J38","v":"01234567891"},null,null,null,null,null,"Nel foglio \\ F 23 / potrai richiamare e stampare tutti i documenti così generati."]
[null,null,null,"Stesso nr. di PROT. =",null,null,null,null,null,"Dettaglio Versamento"]
[null,null,null,"stesso DOCUMENTO",null,null,null,null,null,{"$f":"IF(M1019=0,\"\",CONTRIBUENTE!$F$134)","v":""},null,null,null,null,null,null,null,null,null,null,"Vedi foglio  \\ Tabelle /"]
[null,null,null,"NR.","DATA",null,"Prov.","Ufficio",null,"CODICE","Descrizione libera","importi a debito","codice",null,"Conten-",null,null,"Estremi atto o documento",null,null,"Delega irrevocabile a",null,null,null,"Addeb.",null,"Protocollo",null,"N O T E"]
[null,null,null,"Prot.",null,null,"Concess.","o ente",null,"TRIBUTO","(campo ris. all' ufficio)","VERSATI","destinatario",null,"zioso","CAUSALE",null,"ANNO","NUMERO",null,null,"ABI","CAB",null,"IBAN",null,"alfanumerico"]
[]
["1 di 1000",{"$f":"IF(AG9=$AG$1013,0,IF(M$1019=1,0,D9&\"-\"&YEAR(E9)))","v":"1-2024"},{"$f":"IF(M$1019=1,0,B9&\"-\"&AE9)","v":"1-2024-1"},1,"2024-01-01",null,"PV",null,null,"0001",null,1000,"0001",null,1,"IN",null,"1999","123456",null,"B1",{"$f":"IF(M$1019=1,\"\",IF(U9=\"\",\"\",VLOOKUP(U9,Tabelle!$B$4:$O$6,14,FALSE)))","v":"00001"},{"$f":"IF(M$1019=1,\"\",IF(U9=\"\",\"\",VLOOKUP(U9,Tabelle!$B$4:$Q$6,16,FALSE)))","v":"10000"},null,"B1",null,"AB 100",null,"Testo Libero",null,1,null,{"$f":"IF(E9>0,IF(OR(MONTH(E9)<$L$1030,MONTH(E9)>$L$1031),AG$1013,0),0)","v":0}]
["2",{"$f":"IF(AG10=$AG$1013,0,IF(M$1019=1,0,D10&\"-\"&YEAR(E10)))","v":"2-2024"},"2-2024-1",2,"2024-01-01",null,"MI",null,null,"0002",null,2000,"0002",null,2,"VT",null,"2000","AAAAA",null,"B2",{"$f":"IF(M$1019=1,\"\",IF(U10=\"\",\"\",VLOOKUP(U10,Tabelle!$B$4:$O$6,14,FALSE)))","v":"00002"},{"$f":"IF(M$1019=1,\"\",IF(U10=\"\",\"\",VLOOKUP(U10,Tabelle!$B$4:$Q$6,16,FALSE)))","v":"20000"},null,"B2",null,"CD 100",null,"Testo Libero riga 1",null,{"$f":"IF(B10=\"\",0,IF(B10=B9,COUNTIF(B$9:B9,B10)+1,1))","v":1},{"$f":"IF(OR(D10=\"\",M$1019=1),0,IF(AE10=8,1,0))","v":0},{"$f":"IF(E10>0,IF(OR(MONTH(E10)<$L$1030,MONTH(E10)>$L$1031),AG$1013,0),0)","v":0}]
["3","2-2024","2-2024-2",2,"2024-01-01",null,null,null,null,"0003",null,3000,"0003",null,null,null,null,null,null,null,null,{"$f":"IF(M$1019=1,\"\",IF(U11=\"\",\"\",VLOOKUP(U11,Tabelle!$B$4:$O$6,14,FALSE)))","v":""},{"$f":"IF(M$1019=1,\"\",IF(U11=\"\",\"\",VLOOKUP(U11,Tabelle!$B$4:$Q$6,16,FALSE)))","v":""},null,null,null,null,null,"Testo Libero riga 2",null,{"$f":"IF(B11=\"\",0,IF(B11=B10,COUNTIF(B$9:B10,B11)+1,1))","v":2},0,0]
["4","2-2024","2-2024-3",2,"2024-01-01",null,null,null,null,"A999",null,10000,"A999",null,null,null,null,null,null,null,null,{"$f":"IF(M$1019=1,\"\",IF(U12=\"\",\"\",VLOOKUP(U12,Tabelle!$B$4:$O$6,14,FALSE)))","v":""},{"$f":"IF(M$1019=1,\"\",IF(U12=\"\",\"\",VLOOKUP(U12,Tabelle!$B$4:$Q$6,16,FALSE)))","v":""},null,null,null,null,null,"Righe di esempio",null,{"$f":"IF(B12=\"\",0,IF(B12=B11,COUNTIF(B$9:B11,B12)+1,1))","v":3},0,0]
["5","-1900","-1900-1",null,null,null,null,null,null,null,null,null,null,null,null,null,null,null,null,null,null,{"$f":"IF(M$1019=1,\"\",IF(U13=\"\",\"\",VLOOKUP(U13,Tabelle!$B$4:$O$6,14,FALSE)))","v":""},{"$f":"IF(M$1019=1,\"\",IF(U13=\"\",\"\",VLOOKUP(U13,Tabelle!$B$4:$Q$6,16,FALSE)))","v":""},null,null,null,null,null,null,null,{"$f":"IF(B13=\"\",0,IF(B13=B12,COUNTIF(B$9:B12,B13)+1,1))","v":1},0,0]
["6","-1900","-1900-2",null,null,null,null,null,null,null,null,null,null,null,null,null,null,null,null,null,null,{"$f":"IF(M$1019=1,\"\",IF(U14=\"\",\"\",VLOOKUP(U14,Tabelle!$B$4:$O$6,14,FALSE)))","v":""},{"$f":"IF(M$1019=1,\"\",IF(U14=\"\",\"\",VLOOKUP(U14,Tabelle!$B$4:$Q$6,16,FALSE)))","v":""},null,null,null,null,null,null,null,{"$f":"IF(B14=\"\",0,IF(B14=B13,COUNTIF(B$9:B13,B14)+1,1))","v":2},0,0]
["7","-1900","-1900-3",null,null,null,null,null,null,null,null,null,null,null,null,null,null,null,null,null,null,{"$f":"IF(M$1019=1,\"\",IF(U15=\"\",\"\",VLOOKUP(U15,Tabelle!$B$4:$O$6,14,FALSE)))","v":""},{"$f":"IF(M$1019=1,\"\",IF(U15=\"\",\"\",VLOOKUP(U15,Tabelle!$B$4:$Q$6,16,FALSE)))","v":""},null,null,null,null,null,null,null,{"$f":"IF(B15=\"\",0,IF(B15=B14,COUNTIF(B$9:B14,B15)+1,1))","v":3},0,0]
["8","-1900","-1900-4",null,null,null,null,null,null,null,null,null,null,null,null,null,null,null,null,null,null,{"$f":"IF(M$1019=1,\"\",IF(U16=\"\",\"\",VLOOKUP(U16,Tabelle!$B$4:$O$6,14,FALSE)))","v":""},{"$f":"IF(M$1019=1,\"\",IF(U16=\"\",\"\",VLOOKUP(U16,Tabelle!$B$4:$Q$6,16,FALSE)))","v":""},null,null,null,null,null,null,null,{"$f":"IF(B16=\"\",0,IF(B16=B15,COUNTIF(B$9:B15,B16)+1,1))","v":4},0,0]
["9","-1900","-1900-5",null,null,null,null,null,null,null,null,null,null,null,null,null,null,null,null,null,null,{"$f":"IF(M$1019=1,\"\",IF(U17=\"\",\"\",VLOOKUP(U17,Tabelle!$B$4:$O$6,14,FALSE)))","v":""},{"$f":"IF(M$1019=1,\"\",IF(U17=\"\",\"\",VLOOKUP(U17,Tabelle!$B$4:$Q$6,16,FALSE)))","v":""},null,null,null,null,null,null,null,{"$f":"IF(B17=\"\",0,IF(B17=B16,COUNTIF(B$9:B16,B17)+1,1))","v":5},0,0]
["10","-1900","-1900-6",null,null,null,null,null,null,null,null,null,null,null,null,null,null,null,null,null,null,{"$f":"IF(M$1019=1,\"\",IF(U18=\"\",\"\",VLOOKUP(U18,Tabelle!$B$4:$O$6,14,FALSE)))","v":""},{"$f":"IF(M$1019=1,\"\",IF(U18=\"\",\"\",VLOOKUP(U18,Tabelle!$B$4:$Q$6,16,FALSE)))","v":""},null,null,null,null,null,null,null,{"$f":"IF(B18=\"\",0,IF(B18=B17,COUNTIF(B$9:B17,B18)+1,1))","v":6},0,0]
["11","-1900","-1900-7",null,null,null,null,null,null,null,null,null,null,null,null,null,null,null,null,null,null,{"$f":"IF(M$1019=1,\"\",IF(U19=\"\",\"\",VLOOKUP(U19,Tabelle!$B$4:$O$6,14,FALSE)))","v":""},{"$f":"IF(M$1019=1,\"\",IF(U19=\"\",\"\",VLOOKUP(U19,Tabelle!$B$4:$Q$6,16,FALSE)))","v":""},null,null,null,null,null,null,null,{"$f":"IF(B19=\"\",0,IF(B19=B18,COUNTIF(B$9:B18,B19)+1,1))","v":7},0,0]
["12","-1900","-1900-8",null,null,null,null,null,null,null,null,null,null,null,null,null,null,null,null,null,null,{"$f":"IF(M$1019=1,\"\",IF(U20=\"\",\"\",VLOOKUP(U20,Tabelle!$B$4:$O$6,14,FALSE)))","v":""},{"$f":"IF(M$1019=1,\"\",IF(U20=\"\",\"\",VLOOKUP(U20,Tabelle!$B$4:$Q$6,16,FALSE)))","v":""},null,null,null,null,null,null,null,{"$f":"IF(B20=\"\",0,IF(B20=B19,COUNTIF(B$9:B19,B20)+1,1))","v":8},{"$f":"IF(OR(D20=\"\",M$1019=1),0,IF(AE20=8,1,0))","v":0},0]
["13","-1900","-1900-9",null,null,null,null,null,null,null,null,null,null,null,null,null,null,null,null,null,null,{"$f":"IF(M$1019=1,\"\",IF(U21=\"\",\"\",VLOOKUP(U21,Tabelle!$B$4:$O$6,14,FALSE)))","v":""},{"$f":"IF(M$1019=1,\"\",IF(U21=\"\",\"\",VLOOKUP(U21,Tabelle!$B$4:$Q$6,16,FALSE)))","v":""},null,null,null,null,null,null,null,{"$f":"IF(B21=\"\",0,IF(B21=B20,COUNTIF(B$9:B20,B21)+1,1))","v":9},0,0]
["14","-1900","-1900-10",null,null,null,null,null,null,null,null,null,null,null,null,null,null,null,null,null,null,{"$f":"IF(M$1019=1,\"\",IF(U22=\"\",\"\",VLOOKUP(U22,Tabelle!$B$4:$O$6,14,FALSE)))","v":""},{"$f":"IF(M$1019=1,\"\",IF(U22=\"\",\"\",VLOOKUP(U22,Tabelle!$B$4:$Q$6,16,FALSE)))","v":""},null,null,null,null,null,null,null,{"$f":"IF(B22=\"\",0,IF(B22=B21,COUNTIF(B$9:B21,B22)+1,1))","v":10},0,0]
["15","-1900","-1900-11",null,null,null,null,null,null,null,null,null,null,null,null,null,null,null,null,null,null,{"$f":"IF(M$1019=1,\"\",IF(U23=\"\",\"\",VLOOKUP(U23,Tabelle!$B$4:$O$6,14,FALSE)))","v":""},{"$f":"IF(M$1019=1,\"\",IF(U23=\"\",\"\",VLOOKUP(U23,Tabelle!$B$4:$Q$6,16,FALSE)))","v":""},null,null,null,null,null,null,null,{"$f":"IF(B23=\"\",0,IF(B23=B22,COUNTIF(B$9:B22,B23)+1,1))","v":11},0,0]
["16","-1900","-1900-12",null,null,null,null,null,null,null,null,null,null,null,null,null,null,null,null,null,null,{"$f":"IF(M$1019=1,\"\",IF(U24=\"\",\"\",VLOOKUP(U24,Tabelle!$B$4:$O$6,14,FALSE)))","v":""},{"$f":"IF(M$1019=1,\"\",IF(U24=\"\",\"\",VLOOKUP(U24,Tabelle!$B$4:$Q$6,16,FALSE)))","v":""},null,null,null,null,null,null,null,{"$f":"IF(B24=\"\",0,IF(B24=B23,COUNTIF(B$9:B23,B24)+1,1))","v":12},0,0]
["17","-1900","-1900-13",null,null,null,null,null,null,null,null,null,null,null,null,null,null,null,null,null,null,{"$f":"IF(M$1019=1,\"\",IF(U25=\"\",\"\",VLOOKUP(U25,Tabelle!$B$4:$O$6,14,FALSE)))","v":""},{"$f":"IF(M$1019=1,\"\",IF(U25=\"\",\"\",VLOOKUP(U25,Tabelle!$B$4:$Q$6,16,FALSE)))","v":""},null,null,null,null,null,null,null,{"$f":"IF(B25=\"\",0,IF(B25=B24,COUNTIF(B$9:B24,B25)+1,1))","v":13},0,0]
["18","-1900","-1900-14",null,null,null,null,null,null,null,null,null,null,null,null,null,null,null,null,null,null,{"$f":"IF(M$1019=1,\"\",IF(U26=\"\",\"\",VLOOKUP(U26,Tabelle!$B$4:$O$6,14,FALSE)))","v":""},{"$f":"IF(M$1019=1,\"\",IF(U26=\"\",\"\",VLOOKUP(U26,Tabelle!$B$4:$Q$6,16,FALSE)))","v":""},null,null,null,null,null,null,null,{"$f":"IF(B26=\"\",0,IF(B26=B25,COUNTIF(B$9:B25,B26)+1,1))","v":14},0,0]
["19","-1900","-1900-15",null,null,null,null,null,null,null,null,null,null,null,null,null,null,null,null,null,null,{"$f":"IF(M$1019=1,\"\",IF(U27=\"\",\"\",VLOOKUP(U27,Tabelle!$B$4:$O$6,14,FALSE)))","v":""},{"$f":"IF(M$1019=1,\"\",IF(U27=\"\",\"\",VLOOKUP(U27,Tabelle!$B$4:$Q$6,16,FALSE)))","v":""},null,null,null,null,null,null,null,{"$f":"IF(B27=\"\",0,IF(B27=B26,COUNTIF(B$9:B26,B27)+1,1))","v":15},0,0]
["20","-1900","-1900-16",null,null,null,null,null,null,null,null,null,null,null,null,null,null,null,null,null,null,{"$f":"IF(M$1019=1,\"\",IF(U28=\"\",\"\",VLOOKUP(U28,Tabelle!$B$4:$O$6,14,FALSE)))","v":""},{"$f":"IF(M$1019=1,\"\",IF(U28=\"\",\"\",VLOOKUP(U28,Tabelle!$B$4:$Q$6,16,FALSE)))","v":""},null,null,null,null,null,null,null,{"$f":"IF(B28=\"\",0,IF(B28=B27,COUNTIF(B$9:B27,B28)+1,1))","v":16},0,0]
["21","-1900","-1900-17",null,null,null,null,null,null,null,null,null,null,null,null,null,null,null,null,null,null,{"$f":"IF(M$1019=1,\"\",IF(U29=\"\",\"\",VLOOKUP(U29,Tabelle!$B$4:$O$6,14,FALSE)))","v":""},{"$f":"IF(M$1019=1,\"\",IF(U29=\"\",\"\",VLOOKUP(U29,Tabelle!$B$4:$Q$6,16,FALSE)))","v":""},null,null,null,null,null,null,null,{"$f":"IF(B29=\"\",0,IF(B29=B28,COUNTIF(B$9:B28,B29)+1,1))","v":17},0,0]
["22","-1900","-1900-18",null,null,null,null,null,null,null,null,null,null,null,null,null,null,null,null,null,null,{"$f":"IF(M$1019=1,\"\",IF(U30=\"\",\"\",VLOOKUP(U30,Tabelle!$B$4:$O$6,14,FALSE)))","v":""},{"$f":"IF(M$1019=1,\"\",IF(U30=\"\",\"\",VLOOKUP(U30,Tabelle!$B$4:$Q$6,16,FALSE)))","v":""},null,null,null,null,null,null,null,{"$f":"IF(B30=\"\",0,IF(B30=B29,COUNTIF(B$9:B29,B30)+1,1))","v":18},0,0]
["23","-1900","-1900-19",null,null,null,null,null,null,null,null,null,null,null,null,null,null,null,null,null,null,{"$f":"IF(M$1019=1,\"\",IF(U31=\"\",\"\",VLOOKUP(U31,Tabelle!$B$4:$O$6,14,FALSE)))","v":""},{"$f":"IF(M$1019=1,\"\",IF(U31=\"\",\"\",VLOOKUP(U31,Tabelle!$B$4:$Q$6,16,FALSE)))","v":""},null,null,null,null,null,null,null,{"$f":"IF(B31=\"\",0,IF(B31=B30,COUNTIF(B$9:B30,B31)+1,1))","v":19},0,0]
["24","-1900","-1900-20",null,null,null,null,null,null,null,null,null,null,null,null,null,null,null,null,null,null,{"$f":"IF(M$1019=1,\"\",IF(U32=\"\",\"\",VLOOKUP(U32,Tabelle!$B$4:$O$6,14,FALSE)))","v":""},{"$f":"IF(M$1019=1,\"\",IF(U32=\"\",\"\",VLOOKUP(U32,Tabelle!$B$4:$Q$6,16,FALSE)))","v":""},null,null,null,null,null,null,null,{"$f":"IF(B32=\"\",0,IF(B32=B31,COUNTIF(B$9:B31,B32)+1,1))","v":20},0,0]
["25","-1900","-1900-21",null,null,null,null,null,null,null,null,null,null,null,null,null,null,null,null,null,null,{"$f":"IF(M$1019=1,\"\",IF(U33=\"\",\"\",VLOOKUP(U33,Tabelle!$B$4:$O$6,14,FALSE)))","v":""},{"$f":"IF(M$1019=1,\"\",IF(U33=\"\",\"\",VLOOKUP(U33,Tabelle!$B$4:$Q$6,16,FALSE)))","v":""},null,null,null,null,null,null,null,{"$f":"IF(B33=\"\",0,IF(B33=B32,COUNTIF(B$9:B32,B33)+1,1))","v":21},0,0]
["26","-1900","-1900-22",null,null,null,null,null,null,null,null,null,null,null,null,null,null,null,null,null,null,{"$f":"IF(M$1019=1,\"\",IF(U34=\"\",\"\",VLOOKUP(U34,Tabelle!$B$4:$O$6,14,FALSE)))","v":""},{"$f":"IF(M$1019=1,\"\",IF(U34=\"\",\"\",VLOOKUP(U34,Tabelle!$B$4:$Q$6,16,FALSE)))","v":""},null,null,null,null,null,null,null,{"$f":"IF(B34=\"\",0,IF(B34=B33,COUNTIF(B$9:B33,B34)+1,1))","v":22},0,0]
["27","-1900","-1900-23",null,null,null,null,null,null,null,null,null,null,null,null,null,null,null,null,null,null,{"$f":"IF(M$1019=1,\"\",IF(U35=\"\",\"\",VLOOKUP(U35,Tabelle!$B$4:$O$6,14,FALSE)))","v":""},{"$f":"IF(M$1019=1,\"\",IF(U35=\"\",\"\",VLOOKUP(U35,Tabelle!$B$4:$Q$6,16,FALSE)))","v":""},null,null,null,null,null,null,null,{"$f":"IF(B35=\"\",0,IF(B35=B34,COUNTIF(B$9:B34,B35)+1,1))","v":23},0,0]
["28","-1900","-1900-24",null,null,null,null,null,null,null,null,null,null,null,null,null,null,null,null,null,null,{"$f":"IF(M$1019=1,\"\",IF(U36=\"\",\"\",VLOOKUP(U36,Tabelle!$B$4:$O$6,14,FALSE)))","v":""},{"$f":"IF(M$1019=1,\"\",IF(U36=\"\",\"\",VLOOKUP(U36,Tabelle!$B$4:$Q$6,16,FALSE)))","v":""},null,null,null,null,null,null,null,{"$f":"IF(B36=\"\",0,IF(B36=B35,COUNTIF(B$9:B35,B36)+1,1))","v":24},0,0]
["29","-1900","-1900-25",null,null,null,null,null,null,null,null,null,null,null,null,null,null,null,null,null,null,{"$f":"IF(M$1019=1,\"\",IF(U37=\"\",\"\",VLOOKUP(U37,Tabelle!$B$4:$O$6,14,FALSE)))","v":""},{"$f":"IF(M$1019=1,\"\",IF(U37=\"\",\"\",VLOOKUP(U37,Tabelle!$B$4:$Q$6,16,FALSE)))","v":""},null,null,null,null,null,null,null,{"$f":"IF(B37=\"\",0,IF(B37=B36,COUNTIF(B$9:B36,B37)+1,1))","v":25},0,0]
["30","-1900","-1900-26",null,null,null,null,null,null,null,null,null,null,null,null,null,null,null,null,null,null,{"$f":"IF(M$1019=1,\"\",IF(U38=\"\",\"\",VLOOKUP(U38,Tabelle!$B$4:$O$6,14,FALSE)))","v":""},{"$f":"IF(M$1019=1,\"\",IF(U38=\"\",\"\",VLOOKUP(U38,Tabelle!$B$4:$Q$6,16,FALSE)))","v":""},null,null,null,null,null,null,null,{"$f":"IF(B38=\"\",0,IF(B38=B37,COUNTIF(B$9:B37,B38)+1,1))","v":26},0,0]
["31","-1900","-1900-27",null,null,null,null,null,null,null,null,null,null,null,null,null,null,null,null,null,null,{"$f":"IF(M$1019=1,\"\",IF(U39=\"\",\"\",VLOOKUP(U39,Tabelle!$B$4:$O$6,14,FALSE)))","v":""},{"$f":"IF(M$1019=1,\"\",IF(U39=\"\",\"\",VLOOKUP(U39,Tabelle!$B$4:$Q$6,16,FALSE)))","v":""},null,null,null,null,null,null,null,{"$f":"IF(B39=\"\",0,IF(B39=B38,COUNTIF(B$9:B38,B39)+1,1))","v":27},0,0]
["32","-1900","-1900-28",null,null,null,null,null,null,null,null,null,null,null,null,null,null,null,null,null,null,{"$f":"IF(M$1019=1,\"\",IF(U40=\"\",\"\",VLOOKUP(U40,Tabelle!$B$4:$O$6,14,FALSE)))","v":""},{"$f":"IF(M$1019=1,\"\",IF(U40=\"\",\"\",VLOOKUP(U40,Tabelle!$B$4:$Q$6,16,FALSE)))","v":""},null,null,null,null,null,null,null,{"$f":"IF(B40=\"\",0,IF(B40=B39,COUNTIF(B$9:B39,B40)+1,1))","v":28},0,0]
["33","-1900","-1900-29",null,null,null,null,null,null,null,null,null,null,null,null,null,null,null,null,null,null,{"$f":"IF(M$1019=1,\"\",IF(U41=\"\",\"\",VLOOKUP(U41,Tabelle!$B$4:$O$6,14,FALSE)))","v":""},{"$f":"IF(M$1019=1,\"\",IF(U41=\"\",\"\",VLOOKUP(U41,Tabelle!$B$4:$Q$6,16,FALSE)))","v":""},null,null,null,null,null,null,null,{"$f":"IF(B41=\"\",0,IF(B41=B40,COUNTIF(B$9:B40,B41)+1,1))","v":29},0,0]
["34","-1900","-1900-30",null,null,null,null,null,null,null,null,null,null,null,null,null,null,null,null,null,null,{"$f":"IF(M$1019=1,\"\",IF(U42=\"\",\"\",VLOOKUP(U42,Tabelle!$B$4:$O$6,14,FALSE)))","v":""},{"$f":"IF(M$1019=1,\"\",IF(U42=\"\",\"\",VLOOKUP(U42,Tabelle!$B$4:$Q$6,16,FALSE)))","v":""},null,null,null,null,null,null,null,{"$f":"IF(B42=\"\",0,IF(B42=B41,COUNTIF(B$9:B41,B42)+1,1))","v":30},0,0]
["35","-1900","-1900-31",null,null,null,null,null,null,null,null,null,null,null,null,null,null,null,null,null,null,{"$f":"IF(M$1019=1,\"\",IF(U43=\"\",\"\",VLOOKUP(U43,Tabelle!$B$4:$O$6,14,FALSE)))","v":""},{"$f":"IF(M$1019=1,\"\",IF(U43=\"\",\"\",VLOOKUP(U43,Tabelle!$B$4:$Q$6,16,FALSE)))","v":""},null,null,null,null,null,null,null,{"$f":"IF(B43=\"\",0,IF(B43=B42,COUNTIF(B$9:B42,B43)+1,1))","v":31},0,0]
["36","-1900","-1900-32",null,null,null,null,null,null,null,null,null,null,null,null,null,null,null,null,null,null,{"$f":"IF(M$1019=1,\"\",IF(U44=\"\",\"\",VLOOKUP(U44,Tabelle!$B$4:$O$6,14,FALSE)))","v":""},{"$f":"IF(M$1019=1,\"\",IF(U44=\"\",\"\",VLOOKUP(U44,Tabelle!$B$4:$Q$6,16,FALSE)))","v":""},null,null,null,null,null,null,null,{"$f":"IF(B44=\"\",0,IF(B44=B43,COUNTIF(B$9:B43,B44)+1,1))","v":32},0,0]
["37","-1900","-1900-33",null,null,null,null,null,null,null,null,null,null,null,null,null,null,null,null,null,null,{"$f":"IF(M$1019=1,\"\",IF(U45=\"\",\"\",VLOOKUP(U45,Tabelle!$B$4:$O$6,14,FALSE)))","v":""},{"$f":"IF(M$1019=1,\"\",IF(U45=\"\",\"\",VLOOKUP(U45,Tabelle!$B$4:$Q$6,16,FALSE)))","v":""},null,null,null,null,null,null,null,{"$f":"IF(B45=\"\",0,IF(B45=B44,COUNTIF(B$9:B44,B45)+1,1))","v":33},0,0]
["38","-1900","-1900-34",null,null,null,null,null,null,null,null,null,null,null,null,null,null,null,null,null,null,{"$f":"IF(M$1019=1,\"\",IF(U46=\"\",\"\",VLOOKUP(U46,Tabelle!$B$4:$O$6,14,FALSE)))","v":""},{"$f":"IF(M$1019=1,\"\",IF(U46=\"\",\"\",VLOOKUP(U46,Tabelle!$B$4:$Q$6,16,FALSE)))","v":""},null,null,null,null,null,null,null,{"$f":"IF(B46=\"\",0,IF(B46=B45,COUNTIF(B$9:B45,B46)+1,1))","v":34},0,0]
["39","-1900","-1900-35",null,null,null,null,null,null,null,null,null,null,null,null,null,null,null,null,null,null,{"$f":"IF(M$1019=1,\"\",IF(U47=\"\",\"\",VLOOKUP(U47,Tabelle!$B$4:$O$6,14,FALSE)))","v":""},{"$f":"IF(M$1019=1,\"\",IF(U47=\"\",\"\",VLOOKUP(U47,Tabelle!$B$4:$Q$6,16,FALSE)))","v":""},null,null,null,null,null,null,null,{"$f":"IF(B47=\"\",0,IF(B47=B46,COUNTIF(B$9:B46,B47)+1,1))","v":35},0,0]
["40","-1900","-1900-36",null,null,null,null,null,null,null,null,null,null,null,null,null,null,null,null,null,null,{"$f":"IF(M$1019=1,\"\",IF(U48=\"\",\"\",VLOOKUP(U48,Tabelle!$B$4:$O$6,14,FALSE)))","v":""},{"$f":"IF(M$1019=1,\"\",IF(U48=\"\",\"\",VLOOKUP(U48,Tabelle!$B$4:$Q$6,16,FALSE)))","v":""},null,null,null,null,null,null,null,{"$f":"IF(B48=\"\",0,IF(B48=B47,COUNTIF(B$9:B47,B48)+1,1))","v":36},0,0]
["41","-1900","-1900-37",null,null,null,null,null,null,null,null,null,null,null,null,null,null,null,null,null,null,{"$f":"IF(M$1019=1,\"\",IF(U49=\"\",\"\",VLOOKUP(U49,Tabelle!$B$4:$O$6,14,FALSE)))","v":""},{"$f":"IF(M$1019=1,\"\",IF(U49=\"\",\"\",VLOOKUP(U49,Tabelle!$B$4:$Q$6,16,FALSE)))","v":""},null,null,null,null,null,null,null,{"$f":"IF(B49=\"\",0,IF(B49=B48,COUNTIF(B$9:B48,B49)+1,1))","v":37},0,0]
["42","-1900","-1900-38",null,null,null,null,null,null,null,null,null,null,null,null,null,null,null,null,null,null,{"$f":"IF(M$1019=1,\"\",IF(U50=\"\",\"\",VLOOKUP(U50,Tabelle!$B$4:$O$6,14,FALSE)))","v":""},{"$f":"IF(M$1019=1,\"\",IF(U50=\"\",\"\",VLOOKUP(U50,Tabelle!$B$4:$Q$6,16,FALSE)))","v":""},null,null,null,null,null,null,null,{"$f":"IF(B50=\"\",0,IF(B50=B49,COUNTIF(B$9:B49,B50)+1,1))","v":38},0,0]
["43","-1900","-1900-39",null,null,null,null,null,null,null,null,null,null,null,null,null,null,null,null,null,null,{"$f":"IF(M$1019=1,\"\",IF(U51=\"\",\"\",VLOOKUP(U51,Tabelle!$B$4:$O$6,14,FALSE)))","v":""},{"$f":"IF(M$1019=1,\"\",IF(U51=\"\",\"\",VLOOKUP(U51,Tabelle!$B$4:$Q$6,16,FALSE)))","v":""},null,null,null,null,null,null,null,{"$f":"IF(B51=\"\",0,IF(B51=B50,COUNTIF(B$9:B50,B51)+1,1))","v":39},0,0]
["44","-1900","-1900-40",null,null,null,null,null,null,null,null,null,null,null,null,null,null,null,null,null,null,{"$f":"IF(M$1019=1,\"\",IF(U52=\"\",\"\",VLOOKUP(U52,Tabelle!$B$4:$O$6,14,FALSE)))","v":""},{"$f":"IF(M$1019=1,\"\",IF(U52=\"\",\"\",VLOOKUP(U52,Tabelle!$B$4:$Q$6,16,FALSE)))","v":""},null,null,null,null,null,null,null,{"$f":"IF(B52=\"\",0,IF(B52=B51,COUNTIF(B$9:B51,B52)+1,1))","v":40},0,0]
["45","-1900","-1900-41",null,null,null,null,null,null,null,null,null,null,null,null,null,null,null,null,null,null,{"$f":"IF(M$1019=1,\"\",IF(U53=\"\",\"\",VLOOKUP(U53,Tabelle!$B$4:$O$6,14,FALSE)))","v":""},{"$f":"IF(M$1019=1,\"\",IF(U53=\"\",\"\",VLOOKUP(U53,Tabelle!$B$4:$Q$6,16,FALSE)))","v":""},null,null,null,null,null,null,null,{"$f":"IF(B53=\"\",0,IF(B53=B52,COUNTIF(B$9:B52,B53)+1,1))","v":41},0,0]
["46","-1900","-1900-42",null,null,null,null,null,null,null,null,null,null,null,null,null,null,null,null,null,null,{"$f":"IF(M$1019=1,\"\",IF(U54=\"\",\"\",VLOOKUP(U54,Tabelle!$B$4:$O$6,14,FALSE)))","v":""},{"$f":"IF(M$1019=1,\"\",IF(U54=\"\",\"\",VLOOKUP(U54,Tabelle!$B$4:$Q$6,16,FALSE)))","v":""},null,null,null,null,null,null,null,{"$f":"IF(B54=\"\",0,IF(B54=B53,COUNTIF(B$9:B53,B54)+1,1))","v":42},0,0]
["47","-1900","-1900-43",null,null,null,null,null,null,null,null,null,null,null,null,null,null,null,null,null,null,{"$f":"IF(M$1019=1,\"\",IF(U55=\"\",\"\",VLOOKUP(U55,Tabelle!$B$4:$O$6,14,FALSE)))","v":""},{"$f":"IF(M$1019=1,\"\",IF(U55=\"\",\"\",VLOOKUP(U55,Tabelle!$B$4:$Q$6,16,FALSE)))","v":""},null,null,null,null,null,null,null,{"$f":"IF(B55=\"\",0,IF(B55=B54,COUNTIF(B$9:B54,B55)+1,1))","v":43},0,0]
["48","-1900","-1900-44",null,null,null,null,null,null,null,null,null,null,null,null,null,null,null,null,null,null,{"$f":"IF(M$1019=1,\"\",IF(U56=\"\",\"\",VLOOKUP(U56,Tabelle!$B$4:$O$6,14,FALSE)))","v":""},{"$f":"IF(M$1019=1,\"\",IF(U56=\"\",\"\",VLOOKUP(U56,Tabelle!$B$4:$Q$6,16,FALSE)))","v":""},null,null,null,null,null,null,null,{"$f":"IF(B56=\"\",0,IF(B56=B55,COUNTIF(B$9:B55,B56)+1,1))","v":44},0,0]
["49","-1900","-1900-45",null,null,null,null,null,null,null,null,null,null,null,null,null,null,null,null,null,null,{"$f":"IF(M$1019=1,\"\",IF(U57=\"\",\"\",VLOOKUP(U57,Tabelle!$B$4:$O$6,14,FALSE)))","v":""},{"$f":"IF(M$1019=1,\"\",IF(U57=\"\",\"\",VLOOKUP(U57,Tabelle!$B$4:$Q$6,16,FALSE)))","v":""},null,null,null,null,null,null,null,{"$f":"IF(B57=\"\",0,IF(B57=B56,COUNTIF(B$9:B56,B57)+1,1))","v":45},0,0]
["50","-1900","-1900-46",null,null,null,null,null,null,null,null,null,null,null,null,null,null,null,null,null,null,{"$f":"IF(M$1019=1,\"\",IF(U58=\"\",\"\",VLOOKUP(U58,Tabelle!$B$4:$O$6,14,FALSE)))","v":""},{"$f":"IF(M$1019=1,\"\",IF(U58=\"\",\"\",VLOOKUP(U58,Tabelle!$B$4:$Q$6,16,FALSE)))","v":""},null,null,null,null,null,null,null,{"$f":"IF(B58=\"\",0,IF(B58=B57,COUNTIF(B$9:B57,B58)+1,1))","v":46},0,0]
["51","-1900","-1900-47",null,null,null,null,null,null,null,null,null,null,null,null,null,null,null,null,null,null,{"$f":"IF(M$1019=1,\"\",IF(U59=\"\",\"\",VLOOKUP(U59,Tabelle!$B$4:$O$6,14,FALSE)))","v":""},{"$f":"IF(M$1019=1,\"\",IF(U59=\"\",\"\",VLOOKUP(U59,Tabelle!$B$4:$Q$6,16,FALSE)))","v":""},null,null,null,null,null,null,null,{"$f":"IF(B59=\"\",0,IF(B59=B58,COUNTIF(B$9:B58,B59)+1,1))","v":47},0,0]
["52","-1900","-1900-48",null,null,null,null,null,null,null,null,null,null,null,null,null,null,null,null,null,null,{"$f":"IF(M$1019=1,\"\",IF(U60=\"\",\"\",VLOOKUP(U60,Tabelle!$B$4:$O$6,14,FALSE)))","v":""},{"$f":"IF(M$1019=1,\"\",IF(U60=\"\",\"\",VLOOKUP(U60,Tabelle!$B$4:$Q$6,16,FALSE)))","v":""},null,null,null,null,null,null,null,{"$f":"IF(B60=\"\",0,IF(B60=B59,COUNTIF(B$9:B59,B60)+1,1))","v":48},0,0]
["53","-1900","-1900-49",null,null,null,null,null,null,null,null,null,null,null,null,null,null,null,null,null,null,{"$f":"IF(M$1019=1,\"\",IF(U61=\"\",\"\",VLOOKUP(U61,Tabelle!$B$4:$O$6,14,FALSE)))","v":""},{"$f":"IF(M$1019=1,\"\",IF(U61=\"\",\"\",VLOOKUP(U61,Tabelle!$B$4:$Q$6,16,FALSE)))","v":""},null,null,null,null,null,null,null,{"$f":"IF(B61=\"\",0,IF(B61=B60,COUNTIF(B$9:B60,B61)+1,1))","v":49},0,0]
["54","-1900","-1900-50",null,null,null,null,null,null,null,null,null,null,null,null,null,null,null,null,null,null,{"$f":"IF(M$1019=1,\"\",IF(U62=\"\",\"\",VLOOKUP(U62,Tabelle!$B$4:$O$6,14,FALSE)))","v":""},{"$f":"IF(M$1019=1,\"\",IF(U62=\"\",\"\",VLOOKUP(U62,Tabelle!$B$4:$Q$6,16,FALSE)))","v":""},null,null,null,null,null,null,null,{"$f":"IF(B62=\"\",0,IF(B62=B61,COUNTIF(B$9:B61,B62)+1,1))","v":50},0,0]
["55","-1900","-1900-51",null,null,null,null,null,null,null,null,null,null,null,null,null,null,null,null,null,null,{"$f":"IF(M$1019=1,\"\",IF(U63=\"\",\"\",VLOOKUP(U63,Tabelle!$B$4:$O$6,14,FALSE)))","v":""},{"$f":"IF(M$1019=1,\"\",IF(U63=\"\",\"\",VLOOKUP(U63,Tabelle!$B$4:$Q$6,16,FALSE)))","v":""},null,null,null,null,null,null,null,{"$f":"IF(B63=\"\",0,IF(B63=B62,COUNTIF(B$9:B62,B63)+1,1))","v":51},0,0]
["56","-1900","-1900-52",null,null,null,null,null,null,null,null,null,null,null,null,null,null,null,null,null,null,{"$f":"IF(M$1019=1,\"\",IF(U64=\"\",\"\",VLOOKUP(U64,Tabelle!$B$4:$O$6,14,FALSE)))","v":""},{"$f":"IF(M$1019=1,\"\",IF(U64=\"\",\"\",VLOOKUP(U64,Tabelle!$B$4:$Q$6,16,FALSE)))","v":""},null,null,null,null,null,null,null,{"$f":"IF(B64=\"\",0,IF(B64=B63,COUNTIF(B$9:B63,B64)+1,1))","v":52},0,0]
["57","-1900","-1900-53",null,null,null,null,null,null,null,null,null,null,null,null,null,null,null,null,null,null,{"$f":"IF(M$1019=1,\"\",IF(U65=\"\",\"\",VLOOKUP(U65,Tabelle!$B$4:$O$6,14,FALSE)))","v":""},{"$f":"IF(M$1019=1,\"\",IF(U65=\"\",\"\",VLOOKUP(U65,Tabelle!$B$4:$Q$6,16,FALSE)))","v":""},null,null,null,null,null,null,null,{"$f":"IF(B65=\"\",0,IF(B65=B64,COUNTIF(B$9:B64,B65)+1,1))","v":53},0,0]
["58","-1900","-1900-54",null,null,null,null,null,null,null,null,null,null,null,null,null,null,null,null,null,null,{"$f":"IF(M$1019=1,\"\",IF(U66=\"\",\"\",VLOOKUP(U66,Tabelle!$B$4:$O$6,14,FALSE)))","v":""},{"$f":"IF(M$1019=1,\"\",IF(U66=\"\",\"\",VLOOKUP(U66,Tabelle!$B$4:$Q$6,16,FALSE)))","v":""},null,null,null,null,null,null,null,{"$f":"IF(B66=\"\",0,IF(B66=B65,COUNTIF(B$9:B65,B66)+1,1))","v":54},0,0]
["59","-1900","-1900-55",null,null,null,null,null,null,null,null,null,null,null,null,null,null,null,null,null,null,{"$f":"IF(M$1019=1,\"\",IF(U67=\"\",\"\",VLOOKUP(U67,Tabelle!$B$4:$O$6,14,FALSE)))","v":""},{"$f":"IF(M$1019=1,\"\",IF(U67=\"\",\"\",VLOOKUP(U67,Tabelle!$B$4:$Q$6,16,FALSE)))","v":""},null,null,null,null,null,null,null,{"$f":"IF(B67=\"\",0,IF(B67=B66,COUNTIF(B$9:B66,B67)+1,1))","v":55},0,0]
["60","-1900","-1900-56",null,null,null,null,null,null,null,null,null,null,null,null,null,null,null,null,null,null,{"$f":"IF(M$1019=1,\"\",IF(U68=\"\",\"\",VLOOKUP(U68,Tabelle!$B$4:$O$6,14,FALSE)))","v":""},{"$f":"IF(M$1019=1,\"\",IF(U68=\"\",\"\",VLOOKUP(U68,Tabelle!$B$4:$Q$6,16,FALSE)))","v":""},null,null,null,null,null,null,null,{"$f":"IF(B68=\"\",0,IF(B68=B67,COUNTIF(B$9:B67,B68)+1,1))","v":56},0,0]
["61","-1900","-1900-57",null,null,null,null,null,null,null,null,null,null,null,null,null,null,null,null,null,null,{"$f":"IF(M$1019=1,\"\",IF(U69=\"\",\"\",VLOOKUP(U69,Tabelle!$B$4:$O$6,14,FALSE)))","v":""},{"$f":"IF(M$1019=1,\"\",IF(U69=\"\",\"\",VLOOKUP(U69,Tabelle!$B$4:$Q$6,16,FALSE)))","v":""},null,null,null,null,null,null,null,{"$f":"IF(B69=\"\",0,IF(B69=B68,COUNTIF(B$9:B68,B69)+1,1))","v":57},0,0]
["62","-1900","-1900-58",null,null,null,null,null,null,null,null,null,null,null,null,null,null,null,null,null,null,{"$f":"IF(M$1019=1,\"\",IF(U70=\"\",\"\",VLOOKUP(U70,Tabelle!$B$4:$O$6,14,FALSE)))","v":""},{"$f":"IF(M$1019=1,\"\",IF(U70=\"\",\"\",VLOOKUP(U70,Tabelle!$B$4:$Q$6,16,FALSE)))","v":""},null,null,null,null,null,null,null,{"$f":"IF(B70=\"\",0,IF(B70=B69,COUNTIF(B$9:B69,B70)+1,1))","v":58},0,0]
["63","-1900","-1900-59",null,null,null,null,null,null,null,null,null,null,null,null,null,null,null,null,null,null,{"$f":"IF(M$1019=1,\"\",IF(U71=\"\",\"\",VLOOKUP(U71,Tabelle!$B$4:$O$6,14,FALSE)))","v":""},{"$f":"IF(M$1019=1,\"\",IF(U71=\"\",\"\",VLOOKUP(U71,Tabelle!$B$4:$Q$6,16,FALSE)))","v":""},null,null,null,null,null,null,null,{"$f":"IF(B71=\"\",0,IF(B71=B70,COUNTIF(B$9:B70,B71)+1,1))","v":59},0,0]
["64","-1900","-1900-60",null,null,null,null,null,null,null,null,null,null,null,null,null,null,null,null,null,null,{"$f":"IF(M$1019=1,\"\",IF(U72=\"\",\"\",VLOOKUP(U72,Tabelle!$B$4:$O$6,14,FALSE)))","v":""},{"$f":"IF(M$1019=1,\"\",IF(U72=\"\",\"\",VLOOKUP(U72,Tabelle!$B$4:$Q$6,16,FALSE)))","v":""},null,null,null,null,null,null,null,{"$f":"IF(B72=\"\",0,IF(B72=B71,COUNTIF(B$9:B71,B72)+1,1))","v":60},0,0]
["65","-1900",{"$f":"IF(M$1019=1,0,B73&\"-\"&AE73)","v":"-1900-61"},null,null,null,null,null,null,null,null,null,null,null,null,null,null,null,null,null,null,{"$f":"IF(M$1019=1,\"\",IF(U73=\"\",\"\",VLOOKUP(U73,Tabelle!$B$4:$O$6,14,FALSE)))","v":""},{"$f":"IF(M$1019=1,\"\",IF(U73=\"\",\"\",VLOOKUP(U73,Tabelle!$B$4:$Q$6,16,FALSE)))","v":""},null,null,null,null,null,null,null,{"$f":"IF(B73=\"\",0,IF(B73=B72,COUNTIF(B$9:B72,B73)+1,1))","v":61},0,0]
["66",{"$f":"IF(AG74=$AG$1013,0,IF(M$1019=1,0,D74&\"-\"&YEAR(E74)))","v":"-1900"},"-1900-62",null,null,null,null,null,null,null,null,null,null,null,null,null,null,null,null,null,null,{"$f":"IF(M$1019=1,\"\",IF(U74=\"\",\"\",VLOOKUP(U74,Tabelle!$B$4:$O$6,14,FALSE)))","v":""},{"$f":"IF(M$1019=1,\"\",IF(U74=\"\",\"\",VLOOKUP(U74,Tabelle!$B$4:$Q$6,16,FALSE)))","v":""},null,null,null,null,null,null,null,{"$f":"IF(B74=\"\",0,IF(B74=B73,COUNTIF(B$9:B73,B74)+1,1))","v":62},0,{"$f":"IF(E74>0,IF(OR(MONTH(E74)<$L$1030,MONTH(E74)>$L$1031),AG$1013,0),0)","v":0}]
["67","-1900","-1900-63",null,null,null,null,null,null,null,null,null,null,null,null,null,null,null,null,null,null,{"$f":"IF(M$1019=1,\"\",IF(U75=\"\",\"\",VLOOKUP(U75,Tabelle!$B$4:$O$6,14,FALSE)))","v":""},{"$f":"IF(M$1019=1,\"\",IF(U75=\"\",\"\",VLOOKUP(U75,Tabelle!$B$4:$Q$6,16,FALSE)))","v":""},null,null,null,null,null,null,null,{"$f":"IF(B75=\"\",0,IF(B75=B74,COUNTIF(B$9:B74,B75)+1,1))","v":63},0,0]
["68","-1900","-1900-64",null,null,null,null,null,null,null,null,null,null,null,null,null,null,null,null,null,null,{"$f":"IF(M$1019=1,\"\",IF(U76=\"\",\"\",VLOOKUP(U76,Tabelle!$B$4:$O$6,14,FALSE)))","v":""},{"$f":"IF(M$1019=1,\"\",IF(U76=\"\",\"\",VLOOKUP(U76,Tabelle!$B$4:$Q$6,16,FALSE)))","v":""},null,null,null,null,null,null,null,{"$f":"IF(B76=\"\",0,IF(B76=B75,COUNTIF(B$9:B75,B76)+1,1))","v":64},0,0]
["69","-1900","-1900-65",null,null,null,null,null,null,null,null,null,null,null,null,null,null,null,null,null,null,{"$f":"IF(M$1019=1,\"\",IF(U77=\"\",\"\",VLOOKUP(U77,Tabelle!$B$4:$O$6,14,FALSE)))","v":""},{"$f":"IF(M$1019=1,\"\",IF(U77=\"\",\"\",VLOOKUP(U77,Tabelle!$B$4:$Q$6,16,FALSE)))","v":""},null,null,null,null,null,null,null,{"$f":"IF(B77=\"\",0,IF(B77=B76,COUNTIF(B$9:B76,B77)+1,1))","v":65},0,0]
["70","-1900","-1900-66",null,null,null,null,null,null,null,null,null,null,null,null,null,null,null,null,null,null,{"$f":"IF(M$1019=1,\"\",IF(U78=\"\",\"\",VLOOKUP(U78,Tabelle!$B$4:$O$6,14,FALSE)))","v":""},{"$f":"IF(M$1019=1,\"\",IF(U78=\"\",\"\",VLOOKUP(U78,Tabelle!$B$4:$Q$6,16,FALSE)))","v":""},null,null,null,null,null,null,null,{"$f":"IF(B78=\"\",0,IF(B78=B77,COUNTIF(B$9:B77,B78)+1,1))","v":66},0,0]
["71","-1900","-1900-67",null,null,null,null,null,null,null,null,null,null,null,null,null,null,null,null,null,null,{"$f":"IF(M$1019=1,\"\",IF(U79=\"\",\"\",VLOOKUP(U79,Tabelle!$B$4:$O$6,14,FALSE)))","v":""},{"$f":"IF(M$1019=1,\"\",IF(U79=\"\",\"\",VLOOKUP(U79,Tabelle!$B$4:$Q$6,16,FALSE)))","v":""},null,null,null,null,null,null,null,{"$f":"IF(B79=\"\",0,IF(B79=B78,COUNTIF(B$9:B78,B79)+1,1))","v":67},0,0]
["72","-1900","-1900-68",null,null,null,null,null,null,null,null,null,null,null,null,null,null,null,null,null,null,{"$f":"IF(M$1019=1,\"\",IF(U80=\"\",\"\",VLOOKUP(U80,Tabelle!$B$4:$O$6,14,FALSE)))","v":""},{"$f":"IF(M$1019=1,\"\",IF(U80=\"\",\"\",VLOOKUP(U80,Tabelle!$B$4:$Q$6,16,FALSE)))","v":""},null,null,null,null,null,null,null,{"$f":"IF(B80=\"\",0,IF(B80=B79,COUNTIF(B$9:B79,B80)+1,1))","v":68},0,0]
["73","-1900","-1900-69",null,null,null,null,null,null,null,null,null,null,null,null,null,null,null,null,null,null,{"$f":"IF(M$1019=1,\"\",IF(U81=\"\",\"\",VLOOKUP(U81,Tabelle!$B$4:$O$6,14,FALSE)))","v":""},{"$f":"IF(M$1019=1,\"\",IF(U81=\"\",\"\",VLOOKUP(U81,Tabelle!$B$4:$Q$6,16,FALSE)))","v":""},null,null,null,null,null,null,null,{"$f":"IF(B81=\"\",0,IF(B81=B80,COUNTIF(B$9:B80,B81)+1,1))","v":69},0,0]
["74","-1900","-1900-70",null,null,null,null,null,null,null,null,null,null,null,null,null,null,null,null,null,null,{"$f":"IF(M$1019=1,\"\",IF(U82=\"\",\"\",VLOOKUP(U82,Tabelle!$B$4:$O$6,14,FALSE)))","v":""},{"$f":"IF(M$1019=1,\"\",IF(U82=\"\",\"\",VLOOKUP(U82,Tabelle!$B$4:$Q$6,16,FALSE)))","v":""},null,null,null,null,null,null,null,{"$f":"IF(B82=\"\",0,IF(B82=B81,COUNTIF(B$9:B81,B82)+1,1))","v":70},0,0]
["75","-1900","-1900-71",null,null,null,null,null,null,null,null,null,null,null,null,null,null,null,null,null,null,{"$f":"IF(M$1019=1,\"\",IF(U83=\"\",\"\",VLOOKUP(U83,Tabelle!$B$4:$O$6,14,FALSE)))","v":""},{"$f":"IF(M$1019=1,\"\",IF(U83=\"\",\"\",VLOOKUP(U83,Tabelle!$B$4:$Q$6,16,FALSE)))","v":""},null,null,null,null,null,null,null,{"$f":"IF(B83=\"\",0,IF(B83=B82,COUNTIF(B$9:B82,B83)+1,1))","v":71},0,0]
["76","-1900","-1900-72",null,null,null,null,null,null,null,null,null,null,null,null,null,null,null,null,null,null,{"$f":"IF(M$1019=1,\"\",IF(U84=\"\",\"\",VLOOKUP(U84,Tabelle!$B$4:$O$6,14,FALSE)))","v":""},{"$f":"IF(M$1019=1,\"\",IF(U84=\"\",\"\",VLOOKUP(U84,Tabelle!$B$4:$Q$6,16,FALSE)))","v":""},null,null,null,null,null,null,null,{"$f":"IF(B84=\"\",0,IF(B84=B83,COUNTIF(B$9:B83,B84)+1,1))","v":72},{"$f":"IF(OR(D84=\"\",M$1019=1),0,IF(AE84=8,1,0))","v":0},0]
["77","-1900","-1900-73",null,null,null,null,null,null,null,null,null,null,null,null,null,null,null,null,null,null,{"$f":"IF(M$1019=1,\"\",IF(U85=\"\",\"\",VLOOKUP(U85,Tabelle!$B$4:$O$6,14,FALSE)))","v":""},{"$f":"IF(M$1019=1,\"\",IF(U85=\"\",\"\",VLOOKUP(U85,Tabelle!$B$4:$Q$6,16,FALSE)))","v":""},null,null,null,null,null,null,null,{"$f":"IF(B85=\"\",0,IF(B85=B84,COUNTIF(B$9:B84,B85)+1,1))","v":73},0,0]
["78","-1900","-1900-74",null,null,null,null,null,null,null,null,null,null,null,null,null,null,null,null,null,null,{"$f":"IF(M$1019=1,\"\",IF(U86=\"\",\"\",VLOOKUP(U86,Tabelle!$B$4:$O$6,14,FALSE)))","v":""},{"$f":"IF(M$1019=1,\"\",IF(U86=\"\",\"\",VLOOKUP(U86,Tabelle!$B$4:$Q$6,16,FALSE)))","v":""},null,null,null,null,null,null,null,{"$f":"IF(B86=\"\",0,IF(B86=B85,COUNTIF(B$9:B85,B86)+1,1))","v":74},0,0]
["79","-1900","-1900-75",null,null,null,null,null,null,null,null,null,null,null,null,null,null,null,null,null,null,{"$f":"IF(M$1019=1,\"\",IF(U87=\"\",\"\",VLOOKUP(U87,Tabelle!$B$4:$O$6,14,FALSE)))","v":""},{"$f":"IF(M$1019=1,\"\",IF(U87=\"\",\"\",VLOOKUP(U87,Tabelle!$B$4:$Q$6,16,FALSE)))","v":""},null,null,null,null,null,null,null,{"$f":"IF(B87=\"\",0,IF(B87=B86,COUNTIF(B$9:B86,B87)+1,1))","v":75},0,0]
["80","-1900","-1900-76",null,null,null,null,null,null,null,null,null,null,null,null,null,null,null,null,null,null,{"$f":"IF(M$1019=1,\"\",IF(U88=\"\",\"\",VLOOKUP(U88,Tabelle!$B$4:$O$6,14,FALSE)))","v":""},{"$f":"IF(M$1019=1,\"\",IF(U88=\"\",\"\",VLOOKUP(U88,Tabelle!$B$4:$Q$6,16,FALSE)))","v":""},null,null,null,null,null,null,null,{"$f":"IF(B88=\"\",0,IF(B88=B87,COUNTIF(B$9:B87,B88)+1,1))","v":76},0,0]
["81","-1900","-1900-77",null,null,null,null,null,null,null,null,null,null,null,null,null,null,null,null,null,null,{"$f":"IF(M$1019=1,\"\",IF(U89=\"\",\"\",VLOOKUP(U89,Tabelle!$B$4:$O$6,14,FALSE)))","v":""},{"$f":"IF(M$1019=1,\"\",IF(U89=\"\",\"\",VLOOKUP(U89,Tabelle!$B$4:$Q$6,16,FALSE)))","v":""},null,null,null,null,null,null,null,{"$f":"IF(B89=\"\",0,IF(B89=B88,COUNTIF(B$9:B88,B89)+1,1))","v":77},0,0]
["82","-1900","-1900-78",null,null,null,null,null,null,null,null,null,null,null,null,null,null,null,null,null,null,{"$f":"IF(M$1019=1,\"\",IF(U90=\"\",\"\",VLOOKUP(U90,Tabelle!$B$4:$O$6,14,FALSE)))","v":""},{"$f":"IF(M$1019=1,\"\",IF(U90=\"\",\"\",VLOOKUP(U90,Tabelle!$B$4:$Q$6,16,FALSE)))","v":""},null,null,null,null,null,null,null,{"$f":"IF(B90=\"\",0,IF(B90=B89,COUNTIF(B$9:B89,B90)+1,1))","v":78},0,0]
["83","-1900","-1900-79",null,null,null,null,null,null,null,null,null,null,null,null,null,null,null,null,null,null,{"$f":"IF(M$1019=1,\"\",IF(U91=\"\",\"\",VLOOKUP(U91,Tabelle!$B$4:$O$6,14,FALSE)))","v":""},{"$f":"IF(M$1019=1,\"\",IF(U91=\"\",\"\",VLOOKUP(U91,Tabelle!$B$4:$Q$6,16,FALSE)))","v":""},null,null,null,null,null,null,null,{"$f":"IF(B91=\"\",0,IF(B91=B90,COUNTIF(B$9:B90,B91)+1,1))","v":79},0,0]
["84","-1900","-1900-80",null,null,null,null,null,null,null,null,null,null,null,null,null,null,null,null,null,null,{"$f":"IF(M$1019=1,\"\",IF(U92=\"\",\"\",VLOOKUP(U92,Tabelle!$B$4:$O$6,14,FALSE)))","v":""},{"$f":"IF(M$1019=1,\"\",IF(U92=\"\",\"\",VLOOKUP(U92,Tabelle!$B$4:$Q$6,16,FALSE)))","v":""},null,null,null,null,null,null,null,{"$f":"IF(B92=\"\",0,IF(B92=B91,COUNTIF(B$9:B91,B92)+1,1))","v":80},0,0]
["85","-1900","-1900-81",null,null,null,null,null,null,null,null,null,null,null,null,null,null,null,null,null,null,{"$f":"IF(M$1019=1,\"\",IF(U93=\"\",\"\",VLOOKUP(U93,Tabelle!$B$4:$O$6,14,FALSE)))","v":""},{"$f":"IF(M$1019=1,\"\",IF(U93=\"\",\"\",VLOOKUP(U93,Tabelle!$B$4:$Q$6,16,FALSE)))","v":""},null,null,null,null,null,null,null,{"$f":"IF(B93=\"\",0,IF(B93=B92,COUNTIF(B$9:B92,B93)+1,1))","v":81},0,0]
["86","-1900","-1900-82",null,null,null,null,null,null,null,null,null,null,null,null,null,null,null,null,null,null,{"$f":"IF(M$1019=1,\"\",IF(U94=\"\",\"\",VLOOKUP(U94,Tabelle!$B$4:$O$6,14,FALSE)))","v":""},{"$f":"IF(M$1019=1,\"\",IF(U94=\"\",\"\",VLOOKUP(U94,Tabelle!$B$4:$Q$6,16,FALSE)))","v":""},null,null,null,null,null,null,null,{"$f":"IF(B94=\"\",0,IF(B94=B93,COUNTIF(B$9:B93,B94)+1,1))","v":82},0,0]
["87","-1900","-1900-83",null,null,null,null,null,null,null,null,null,null,null,null,null,null,null,null,null,null,{"$f":"IF(M$1019=1,\"\",IF(U95=\"\",\"\",VLOOKUP(U95,Tabelle!$B$4:$O$6,14,FALSE)))","v":""},{"$f":"IF(M$1019=1,\"\",IF(U95=\"\",\"\",VLOOKUP(U95,Tabelle!$B$4:$Q$6,16,FALSE)))","v":""},null,null,null,null,null,null,null,{"$f":"IF(B95=\"\",0,IF(B95=B94,COUNTIF(B$9:B94,B95)+1,1))","v":83},0,0]
["88","-1900","-1900-84",null,null,null,null,null,null,null,null,null,null,null,null,null,null,null,null,null,null,{"$f":"IF(M$1019=1,\"\",IF(U96=\"\",\"\",VLOOKUP(U96,Tabelle!$B$4:$O$6,14,FALSE)))","v":""},{"$f":"IF(M$1019=1,\"\",IF(U96=\"\",\"\",VLOOKUP(U96,Tabelle!$B$4:$Q$6,16,FALSE)))","v":""},null,null,null,null,null,null,null,{"$f":"IF(B96=\"\",0,IF(B96=B95,COUNTIF(B$9:B95,B96)+1,1))","v":84},0,0]
["89","-1900","-1900-85",null,null,null,null,null,null,null,null,null,null,null,null,null,null,null,null,null,null,{"$f":"IF(M$1019=1,\"\",IF(U97=\"\",\"\",VLOOKUP(U97,Tabelle!$B$4:$O$6,14,FALSE)))","v":""},{"$f":"IF(M$1019=1,\"\",IF(U97=\"\",\"\",VLOOKUP(U97,Tabelle!$B$4:$Q$6,16,FALSE)))","v":""},null,null,null,null,null,null,null,{"$f":"IF(B97=\"\",0,IF(B97=B96,COUNTIF(B$9:B96,B97)+1,1))","v":85},0,0]
["90","-1900","-1900-86",null,null,null,null,null,null,null,null,null,null,null,null,null,null,null,null,null,null,{"$f":"IF(M$1019=1,\"\",IF(U98=\"\",\"\",VLOOKUP(U98,Tabelle!$B$4:$O$6,14,FALSE)))","v":""},{"$f":"IF(M$1019=1,\"\",IF(U98=\"\",\"\",VLOOKUP(U98,Tabelle!$B$4:$Q$6,16,FALSE)))","v":""},null,null,null,null,null,null,null,{"$f":"IF(B98=\"\",0,IF(B98=B97,COUNTIF(B$9:B97,B98)+1,1))","v":86},0,0]
["91","-1900","-1900-87",null,null,null,null,null,null,null,null,null,null,null,null,null,null,null,null,null,null,{"$f":"IF(M$1019=1,\"\",IF(U99=\"\",\"\",VLOOKUP(U99,Tabelle!$B$4:$O$6,14,FALSE)))","v":""},{"$f":"IF(M$1019=1,\"\",IF(U99=\"\",\"\",VLOOKUP(U99,Tabelle!$B$4:$Q$6,16,FALSE)))","v":""},null,null,null,null,null,null,null,{"$f":"IF(B99=\"\",0,IF(B99=B98,COUNTIF(B$9:B98,B99)+1,1))","v":87},0,0]
["92","-1900","-1900-88",null,null,null,null,null,null,null,null,null,null,null,null,null,null,null,null,null,null,{"$f":"IF(M$1019=1,\"\",IF(U100=\"\",\"\",VLOOKUP(U100,Tabelle!$B$4:$O$6,14,FALSE)))","v":""},{"$f":"IF(M$1019=1,\"\",IF(U100=\"\",\"\",VLOOKUP(U100,Tabelle!$B$4:$Q$6,16,FALSE)))","v":""},null,null,null,null,null,null,null,{"$f":"IF(B100=\"\",0,IF(B100=B99,COUNTIF(B$9:B99,B100)+1,1))","v":88},0,0]
["93","-1900","-1900-89",null,null,null,null,null,null,null,null,null,null,null,null,null,null,null,null,null,null,{"$f":"IF(M$1019=1,\"\",IF(U101=\"\",\"\",VLOOKUP(U101,Tabelle!$B$4:$O$6,14,FALSE)))","v":""},{"$f":"IF(M$1019=1,\"\",IF(U101=\"\",\"\",VLOOKUP(U101,Tabelle!$B$4:$Q$6,16,FALSE)))","v":""},null,null,null,null,null,null,null,{"$f":"IF(B101=\"\",0,IF(B101=B100,COUNTIF(B$9:B100,B101)+1,1))","v":89},0,0]
["94","-1900","-1900-90",null,null,null,null,null,null,null,null,null,null,null,null,null,null,null,null,null,null,{"$f":"IF(M$1019=1,\"\",IF(U102=\"\",\"\",VLOOKUP(U102,Tabelle!$B$4:$O$6,14,FALSE)))","v":""},{"$f":"IF(M$1019=1,\"\",IF(U102=\"\",\"\",VLOOKUP(U102,Tabelle!$B$4:$Q$6,16,FALSE)))","v":""},null,null,null,null,null,null,null,{"$f":"IF(B102=\"\",0,IF(B102=B101,COUNTIF(B$9:B101,B102)+1,1))","v":90},0,0]
["95","-1900","-1900-91",null,null,null,null,null,null,null,null,null,null,null,null,null,null,null,null,null,null,{"$f":"IF(M$1019=1,\"\",IF(U103=\"\",\"\",VLOOKUP(U103,Tabelle!$B$4:$O$6,14,FALSE)))","v":""},{"$f":"IF(M$1019=1,\"\",IF(U103=\"\",\"\",VLOOKUP(U103,Tabelle!$B$4:$Q$6,16,FALSE)))","v":""},null,null,null,null,null,null,null,{"$f":"IF(B103=\"\",0,IF(B103=B102,COUNTIF(B$9:B102,B103)+1,1))","v":91},0,0]
["96","-1900","-1900-92",null,null,null,null,null,null,null,null,null,null,null,null,null,null,null,null,null,null,{"$f":"IF(M$1019=1,\"\",IF(U104=\"\",\"\",VLOOKUP(U104,Tabelle!$B$4:$O$6,14,FALSE)))","v":""},{"$f":"IF(M$1019=1,\"\",IF(U104=\"\",\"\",VLOOKUP(U104,Tabelle!$B$4:$Q$6,16,FALSE)))","v":""},null,null,null,null,null,null,null,{"$f":"IF(B104=\"\",0,IF(B104=B103,COUNTIF(B$9:B103,B104)+1,1))","v":92},0,0]
["97","-1900","-1900-93",null,null,null,null,null,null,null,null,null,null,null,null,null,null,null,null,null,null,{"$f":"IF(M$1019=1,\"\",IF(U105=\"\",\"\",VLOOKUP(U105,Tabelle!$B$4:$O$6,14,FALSE)))","v":""},{"$f":"IF(M$1019=1,\"\",IF(U105=\"\",\"\",VLOOKUP(U105,Tabelle!$B$4:$Q$6,16,FALSE)))","v":""},null,null,null,null,null,null,null,{"$f":"IF(B105=\"\",0,IF(B105=B104,COUNTIF(B$9:B104,B105)+1,1))","v":93},0,0]
["98","-1900","-1900-94",null,null,null,null,null,null,null,null,null,null,null,null,null,null,null,null,null,null,{"$f":"IF(M$1019=1,\"\",IF(U106=\"\",\"\",VLOOKUP(U106,Tabelle!$B$4:$O$6,14,FALSE)))","v":""},{"$f":"IF(M$1019=1,\"\",IF(U106=\"\",\"\",VLOOKUP(U106,Tabelle!$B$4:$Q$6,16,FALSE)))","v":""},null,null,null,null,null,null,null,{"$f":"IF(B106=\"\",0,IF(B106=B105,COUNTIF(B$9:B105,B106)+1,1))","v":94},0,0]
["99","-1900","-1900-95",null,null,null,null,null,null,null,null,null,null,null,null,null,null,null,null,null,null,{"$f":"IF(M$1019=1,\"\",IF(U107=\"\",\"\",VLOOKUP(U107,Tabelle!$B$4:$O$6,14,FALSE)))","v":""},{"$f":"IF(M$1019=1,\"\",IF(U107=\"\",\"\",VLOOKUP(U107,Tabelle!$B$4:$Q$6,16,FALSE)))","v":""},null,null,null,null,null,null,null,{"$f":"IF(B107=\"\",0,IF(B107=B106,COUNTIF(B$9:B106,B107)+1,1))","v":95},0,0]
["100","-1900","-1900-96",null,null,null,null,null,null,null,null,null,null,null,null,null,null,null,null,null,null,{"$f":"IF(M$1019=1,\"\",IF(U108=\"\",\"\",VLOOKUP(U108,Tabelle!$B$4:$O$6,14,FALSE)))","v":""},{"$f":"IF(M$1019=1,\"\",IF(U108=\"\",\"\",VLOOKUP(U108,Tabelle!$B$4:$Q$6,16,FALSE)))","v":""},null,null,null,null,null,null,null,{"$f":"IF(B108=\"\",0,IF(B108=B107,COUNTIF(B$9:B107,B108)+1,1))","v":96},0,0]
["101","-1900","-1900-97",null,null,null,null,null,null,null,null,null,null,null,null,null,null,null,null,null,null,{"$f":"IF(M$1019=1,\"\",IF(U109=\"\",\"\",VLOOKUP(U109,Tabelle!$B$4:$O$6,14,FALSE)))","v":""},{"$f":"IF(M$1019=1,\"\",IF(U109=\"\",\"\",VLOOKUP(U109,Tabelle!$B$4:$Q$6,16,FALSE)))","v":""},null,null,null,null,null,null,null,{"$f":"IF(B109=\"\",0,IF(B109=B108,COUNTIF(B$9:B108,B109)+1,1))","v":97},0,0]
["102","-1900","-1900-98",null,null,null,null,null,null,null,null,null,null,null,null,null,null,null,null,null,null,{"$f":"IF(M$1019=1,\"\",IF(U110=\"\",\"\",VLOOKUP(U110,Tabelle!$B$4:$O$6,14,FALSE)))","v":""},{"$f":"IF(M$1019=1,\"\",IF(U110=\"\",\"\",VLOOKUP(U110,Tabelle!$B$4:$Q$6,16,FALSE)))","v":""},null,null,null,null,null,null,null,{"$f":"IF(B110=\"\",0,IF(B110=B109,COUNTIF(B$9:B109,B110)+1,1))","v":98},0,0]
["103","-1900","-1900-99",null,null,null,null,null,null,null,null,null,null,null,null,null,null,null,null,null,null,{"$f":"IF(M$1019=1,\"\",IF(U111=\"\",\"\",VLOOKUP(U111,Tabelle!$B$4:$O$6,14,FALSE)))","v":""},{"$f":"IF(M$1019=1,\"\",IF(U111=\"\",\"\",VLOOKUP(U111,Tabelle!$B$4:$Q$6,16,FALSE)))","v":""},null,null,null,null,null,null,null,{"$f":"IF(B111=\"\",0,IF(B111=B110,COUNTIF(B$9:B110,B111)+1,1))","v":99},0,0]
["104","-1900","-1900-100",null,null,null,null,null,null,null,null,null,null,null,null,null,null,null,null,null,null,{"$f":"IF(M$1019=1,\"\",IF(U112=\"\",\"\",VLOOKUP(U112,Tabelle!$B$4:$O$6,14,FALSE)))","v":""},{"$f":"IF(M$1019=1,\"\",IF(U112=\"\",\"\",VLOOKUP(U112,Tabelle!$B$4:$Q$6,16,FALSE)))","v":""},null,null,null,null,null,null,null,{"$f":"IF(B112=\"\",0,IF(B112=B111,COUNTIF(B$9:B111,B112)+1,1))","v":100},0,0]
["105","-1900","-1900-101",null,null,null,null,null,null,null,null,null,null,null,null,null,null,null,null,null,null,{"$f":"IF(M$1019=1,\"\",IF(U113=\"\",\"\",VLOOKUP(U113,Tabelle!$B$4:$O$6,14,FALSE)))","v":""},{"$f":"IF(M$1019=1,\"\",IF(U113=\"\",\"\",VLOOKUP(U113,Tabelle!$B$4:$Q$6,16,FALSE)))","v":""},null,null,null,null,null,null,null,{"$f":"IF(B113=\"\",0,IF(B113=B112,COUNTIF(B$9:B112,B113)+1,1))","v":101},0,0]
["106","-1900","-1900-102",null,null,null,null,null,null,null,null,null,null,null,null,null,null,null,null,null,null,{"$f":"IF(M$1019=1,\"\",IF(U114=\"\",\"\",VLOOKUP(U114,Tabelle!$B$4:$O$6,14,FALSE)))","v":""},{"$f":"IF(M$1019=1,\"\",IF(U114=\"\",\"\",VLOOKUP(U114,Tabelle!$B$4:$Q$6,16,FALSE)))","v":""},null,null,null,null,null,null,null,{"$f":"IF(B114=\"\",0,IF(B114=B113,COUNTIF(B$9:B113,B114)+1,1))","v":102},0,0]
["107","-1900","-1900-103",null,null,null,null,null,null,null,null,null,null,null,null,null,null,null,null,null,null,{"$f":"IF(M$1019=1,\"\",IF(U115=\"\",\"\",VLOOKUP(U115,Tabelle!$B$4:$O$6,14,FALSE)))","v":""},{"$f":"IF(M$1019=1,\"\",IF(U115=\"\",\"\",VLOOKUP(U115,Tabelle!$B$4:$Q$6,16,FALSE)))","v":""},null,null,null,null,null,null,null,{"$f":"IF(B115=\"\",0,IF(B115=B114,COUNTIF(B$9:B114,B115)+1,1))","v":103},0,0]
["108","-1900","-1900-104",null,null,null,null,null,null,null,null,null,null,null,null,null,null,null,null,null,null,{"$f":"IF(M$1019=1,\"\",IF(U116=\"\",\"\",VLOOKUP(U116,Tabelle!$B$4:$O$6,14,FALSE)))","v":""},{"$f":"IF(M$1019=1,\"\",IF(U116=\"\",\"\",VLOOKUP(U116,Tabelle!$B$4:$Q$6,16,FALSE)))","v":""},null,null,null,null,null,null,null,{"$f":"IF(B116=\"\",0,IF(B116=B115,COUNTIF(B$9:B115,B116)+1,1))","v":104},0,0]
["109","-1900","-1900-105",null,null,null,null,null,null,null,null,null,null,null,null,null,null,null,null,null,null,{"$f":"IF(M$1019=1,\"\",IF(U117=\"\",\"\",VLOOKUP(U117,Tabelle!$B$4:$O$6,14,FALSE)))","v":""},{"$f":"IF(M$1019=1,\"\",IF(U117=\"\",\"\",VLOOKUP(U117,Tabelle!$B$4:$Q$6,16,FALSE)))","v":""},null,null,null,null,null,null,null,{"$f":"IF(B117=\"\",0,IF(B117=B116,COUNTIF(B$9:B116,B117)+1,1))","v":105},0,0]
["110","-1900","-1900-106",null,null,null,null,null,null,null,null,null,null,null,null,null,null,null,null,null,null,{"$f":"IF(M$1019=1,\"\",IF(U118=\"\",\"\",VLOOKUP(U118,Tabelle!$B$4:$O$6,14,FALSE)))","v":""},{"$f":"IF(M$1019=1,\"\",IF(U118=\"\",\"\",VLOOKUP(U118,Tabelle!$B$4:$Q$6,16,FALSE)))","v":""},null,null,null,null,null,null,null,{"$f":"IF(B118=\"\",0,IF(B118=B117,COUNTIF(B$9:B117,B118)+1,1))","v":106},0,0]
["111","-1900","-1900-107",null,null,null,null,null,null,null,null,null,null,null,null,null,null,null,null,null,null,{"$f":"IF(M$1019=1,\"\",IF(U119=\"\",\"\",VLOOKUP(U119,Tabelle!$B$4:$O$6,14,FALSE)))","v":""},{"$f":"IF(M$1019=1,\"\",IF(U119=\"\",\"\",VLOOKUP(U119,Tabelle!$B$4:$Q$6,16,FALSE)))","v":""},null,null,null,null,null,null,null,{"$f":"IF(B119=\"\",0,IF(B119=B118,COUNTIF(B$9:B118,B119)+1,1))","v":107},0,0]
["112","-1900","-1900-108",null,null,null,null,null,null,null,null,null,null,null,null,null,null,null,null,null,null,{"$f":"IF(M$1019=1,\"\",IF(U120=\"\",\"\",VLOOKUP(U120,Tabelle!$B$4:$O$6,14,FALSE)))","v":""},{"$f":"IF(M$1019=1,\"\",IF(U120=\"\",\"\",VLOOKUP(U120,Tabelle!$B$4:$Q$6,16,FALSE)))","v":""},null,null,null,null,null,null,null,{"$f":"IF(B120=\"\",0,IF(B120=B119,COUNTIF(B$9:B119,B120)+1,1))","v":108},0,0]
["113","-1900","-1900-109",null,null,null,null,null,null,null,null,null,null,null,null,null,null,null,null,null,null,{"$f":"IF(M$1019=1,\"\",IF(U121=\"\",\"\",VLOOKUP(U121,Tabelle!$B$4:$O$6,14,FALSE)))","v":""},{"$f":"IF(M$1019=1,\"\",IF(U121=\"\",\"\",VLOOKUP(U121,Tabelle!$B$4:$Q$6,16,FALSE)))","v":""},null,null,null,null,null,null,null,{"$f":"IF(B121=\"\",0,IF(B121=B120,COUNTIF(B$9:B120,B121)+1,1))","v":109},0,0]
["114","-1900","-1900-110",null,null,null,null,null,null,null,null,null,null,null,null,null,null,null,null,null,null,{"$f":"IF(M$1019=1,\"\",IF(U122=\"\",\"\",VLOOKUP(U122,Tabelle!$B$4:$O$6,14,FALSE)))","v":""},{"$f":"IF(M$1019=1,\"\",IF(U122=\"\",\"\",VLOOKUP(U122,Tabelle!$B$4:$Q$6,16,FALSE)))","v":""},null,null,null,null,null,null,null,{"$f":"IF(B122=\"\",0,IF(B122=B121,COUNTIF(B$9:B121,B122)+1,1))","v":110},0,0]
["115","-1900","-1900-111",null,null,null,null,null,null,null,null,null,null,null,null,null,null,null,null,null,null,{"$f":"IF(M$1019=1,\"\",IF(U123=\"\",\"\",VLOOKUP(U123,Tabelle!$B$4:$O$6,14,FALSE)))","v":""},{"$f":"IF(M$1019=1,\"\",IF(U123=\"\",\"\",VLOOKUP(U123,Tabelle!$B$4:$Q$6,16,FALSE)))","v":""},null,null,null,null,null,null,null,{"$f":"IF(B123=\"\",0,IF(B123=B122,COUNTIF(B$9:B122,B123)+1,1))","v":111},0,0]
["116","-1900","-1900-112",null,null,null,null,null,null,null,null,null,null,null,null,null,null,null,null,null,null,{"$f":"IF(M$1019=1,\"\",IF(U124=\"\",\"\",VLOOKUP(U124,Tabelle!$B$4:$O$6,14,FALSE)))","v":""},{"$f":"IF(M$1019=1,\"\",IF(U124=\"\",\"\",VLOOKUP(U124,Tabelle!$B$4:$Q$6,16,FALSE)))","v":""},null,null,null,null,null,null,null,{"$f":"IF(B124=\"\",0,IF(B124=B123,COUNTIF(B$9:B123,B124)+1,1))","v":112},0,0]
["117","-1900","-1900-113",null,null,null,null,null,null,null,null,null,null,null,null,null,null,null,null,null,null,{"$f":"IF(M$1019=1,\"\",IF(U125=\"\",\"\",VLOOKUP(U125,Tabelle!$B$4:$O$6,14,FALSE)))","v":""},{"$f":"IF(M$1019=1,\"\",IF(U125=\"\",\"\",VLOOKUP(U125,Tabelle!$B$4:$Q$6,16,FALSE)))","v":""},null,null,null,null,null,null,null,{"$f":"IF(B125=\"\",0,IF(B125=B124,COUNTIF(B$9:B124,B125)+1,1))","v":113},0,0]
["118","-1900","-1900-114",null,null,null,null,null,null,null,null,null,null,null,null,null,null,null,null,null,null,{"$f":"IF(M$1019=1,\"\",IF(U126=\"\",\"\",VLOOKUP(U126,Tabelle!$B$4:$O$6,14,FALSE)))","v":""},{"$f":"IF(M$1019=1,\"\",IF(U126=\"\",\"\",VLOOKUP(U126,Tabelle!$B$4:$Q$6,16,FALSE)))","v":""},null,null,null,null,null,null,null,{"$f":"IF(B126=\"\",0,IF(B126=B125,COUNTIF(B$9:B125,B126)+1,1))","v":114},0,0]
["119","-1900","-1900-115",null,null,null,null,null,null,null,null,null,null,null,null,null,null,null,null,null,null,{"$f":"IF(M$1019=1,\"\",IF(U127=\"\",\"\",VLOOKUP(U127,Tabelle!$B$4:$O$6,14,FALSE)))","v":""},{"$f":"IF(M$1019=1,\"\",IF(U127=\"\",\"\",VLOOKUP(U127,Tabelle!$B$4:$Q$6,16,FALSE)))","v":""},null,null,null,null,null,null,null,{"$f":"IF(B127=\"\",0,IF(B127=B126,COUNTIF(B$9:B126,B127)+1,1))","v":115},0,0]
["120","-1900","-1900-116",null,null,null,null,null,null,null,null,null,null,null,null,null,null,null,null,null,null,{"$f":"IF(M$1019=1,\"\",IF(U128=\"\",\"\",VLOOKUP(U128,Tabelle!$B$4:$O$6,14,FALSE)))","v":""},{"$f":"IF(M$1019=1,\"\",IF(U128=\"\",\"\",VLOOKUP(U128,Tabelle!$B$4:$Q$6,16,FALSE)))","v":""},null,null,null,null,null,null,null,{"$f":"IF(B128=\"\",0,IF(B128=B127,COUNTIF(B$9:B127,B128)+1,1))","v":116},0,0]
["121","-1900","-1900-117",null,null,null,null,null,null,null,null,null,null,null,null,null,null,null,null,null,null,{"$f":"IF(M$1019=1,\"\",IF(U129=\"\",\"\",VLOOKUP(U129,Tabelle!$B$4:$O$6,14,FALSE)))","v":""},{"$f":"IF(M$1019=1,\"\",IF(U129=\"\",\"\",VLOOKUP(U129,Tabelle!$B$4:$Q$6,16,FALSE)))","v":""},null,null,null,null,null,null,null,{"$f":"IF(B129=\"\",0,IF(B129=B128,COUNTIF(B$9:B128,B129)+1,1))","v":117},0,0]
["122","-1900","-1900-118",null,null,null,null,null,null,null,null,null,null,null,null,null,null,null,null,null,null,{"$f":"IF(M$1019=1,\"\",IF(U130=\"\",\"\",VLOOKUP(U130,Tabelle!$B$4:$O$6,14,FALSE)))","v":""},{"$f":"IF(M$1019=1,\"\",IF(U130=\"\",\"\",VLOOKUP(U130,Tabelle!$B$4:$Q$6,16,FALSE)))","v":""},null,null,null,null,null,null,null,{"$f":"IF(B130=\"\",0,IF(B130=B129,COUNTIF(B$9:B129,B130)+1,1))","v":118},0,0]
["123","-1900","-1900-119",null,null,null,null,null,null,null,null,null,null,null,null,null,null,null,null,null,null,{"$f":"IF(M$1019=1,\"\",IF(U131=\"\",\"\",VLOOKUP(U131,Tabelle!$B$4:$O$6,14,FALSE)))","v":""},{"$f":"IF(M$1019=1,\"\",IF(U131=\"\",\"\",VLOOKUP(U131,Tabelle!$B$4:$Q$6,16,FALSE)))","v":""},null,null,null,null,null,null,null,{"$f":"IF(B131=\"\",0,IF(B131=B130,COUNTIF(B$9:B130,B131)+1,1))","v":119},0,0]
["124","-1900","-1900-120",null,null,null,null,null,null,null,null,null,null,null,null,null,null,null,null,null,null,{"$f":"IF(M$1019=1,\"\",IF(U132=\"\",\"\",VLOOKUP(U132,Tabelle!$B$4:$O$6,14,FALSE)))","v":""},{"$f":"IF(M$1019=1,\"\",IF(U132=\"\",\"\",VLOOKUP(U132,Tabelle!$B$4:$Q$6,16,FALSE)))","v":""},null,null,null,null,null,null,null,{"$f":"IF(B132=\"\",0,IF(B132=B131,COUNTIF(B$9:B131,B132)+1,1))","v":120},0,0]
["125","-1900","-1900-121",null,null,null,null,null,null,null,null,null,null,null,null,null,null,null,null,null,null,{"$f":"IF(M$1019=1,\"\",IF(U133=\"\",\"\",VLOOKUP(U133,Tabelle!$B$4:$O$6,14,FALSE)))","v":""},{"$f":"IF(M$1019=1,\"\",IF(U133=\"\",\"\",VLOOKUP(U133,Tabelle!$B$4:$Q$6,16,FALSE)))","v":""},null,null,null,null,null,null,null,{"$f":"IF(B133=\"\",0,IF(B133=B132,COUNTIF(B$9:B132,B133)+1,1))","v":121},0,0]
["126","-1900","-1900-122",null,null,null,null,null,null,null,null,null,null,null,null,null,null,null,null,null,null,{"$f":"IF(M$1019=1,\"\",IF(U134=\"\",\"\",VLOOKUP(U134,Tabelle!$B$4:$O$6,14,FALSE)))","v":""},{"$f":"IF(M$1019=1,\"\",IF(U134=\"\",\"\",VLOOKUP(U134,Tabelle!$B$4:$Q$6,16,FALSE)))","v":""},null,null,null,null,null,null,null,{"$f":"IF(B134=\"\",0,IF(B134=B133,COUNTIF(B$9:B133,B134)+1,1))","v":122},0,0]
["127","-1900","-1900-123",null,null,null,null,null,null,null,null,null,null,null,null,null,null,null,null,null,null,{"$f":"IF(M$1019=1,\"\",IF(U135=\"\",\"\",VLOOKUP(U135,Tabelle!$B$4:$O$6,14,FALSE)))","v":""},{"$f":"IF(M$1019=1,\"\",IF(U135=\"\",\"\",VLOOKUP(U135,Tabelle!$B$4:$Q$6,16,FALSE)))","v":""},null,null,null,null,null,null,null,{"$f":"IF(B135=\"\",0,IF(B135=B134,COUNTIF(B$9:B134,B135)+1,1))","v":123},0,0]
["128","-1900","-1900-124",null,null,null,null,null,null,null,null,null,null,null,null,null,null,null,null,null,null,{"$f":"IF(M$1019=1,\"\",IF(U136=\"\",\"\",VLOOKUP(U136,Tabelle!$B$4:$O$6,14,FALSE)))","v":""},{"$f":"IF(M$1019=1,\"\",IF(U136=\"\",\"\",VLOOKUP(U136,Tabelle!$B$4:$Q$6,16,FALSE)))","v":""},null,null,null,null,null,null,null,{"$f":"IF(B136=\"\",0,IF(B136=B135,COUNTIF(B$9:B135,B136)+1,1))","v":124},0,0]
["129","-1900",{"$f":"IF(M$1019=1,0,B137&\"-\"&AE137)","v":"-1900-125"},null,null,null,null,null,null,null,null,null,null,null,null,null,null,null,null,null,null,{"$f":"IF(M$1019=1,\"\",IF(U137=\"\",\"\",VLOOKUP(U137,Tabelle!$B$4:$O$6,14,FALSE)))","v":""},{"$f":"IF(M$1019=1,\"\",IF(U137=\"\",\"\",VLOOKUP(U137,Tabelle!$B$4:$Q$6,16,FALSE)))","v":""},null,null,null,null,null,null,null,{"$f":"IF(B137=\"\",0,IF(B137=B136,COUNTIF(B$9:B136,B137)+1,1))","v":125},0,0]
["130",{"$f":"IF(AG138=$AG$1013,0,IF(M$1019=1,0,D138&\"-\"&YEAR(E138)))","v":"-1900"},"-1900-126",null,null,null,null,null,null,null,null,null,null,null,null,null,null,null,null,null,null,{"$f":"IF(M$1019=1,\"\",IF(U138=\"\",\"\",VLOOKUP(U138,Tabelle!$B$4:$O$6,14,FALSE)))","v":""},{"$f":"IF(M$1019=1,\"\",IF(U138=\"\",\"\",VLOOKUP(U138,Tabelle!$B$4:$Q$6,16,FALSE)))","v":""},null,null,null,null,null,null,null,{"$f":"IF(B138=\"\",0,IF(B138=B137,COUNTIF(B$9:B137,B138)+1,1))","v":126},0,{"$f":"IF(E138>0,IF(OR(MONTH(E138)<$L$1030,MONTH(E138)>$L$1031),AG$1013,0),0)","v":0}]
["131","-1900","-1900-127",null,null,null,null,null,null,null,null,null,null,null,null,null,null,null,null,null,null,{"$f":"IF(M$1019=1,\"\",IF(U139=\"\",\"\",VLOOKUP(U139,Tabelle!$B$4:$O$6,14,FALSE)))","v":""},{"$f":"IF(M$1019=1,\"\",IF(U139=\"\",\"\",VLOOKUP(U139,Tabelle!$B$4:$Q$6,16,FALSE)))","v":""},null,null,null,null,null,null,null,{"$f":"IF(B139=\"\",0,IF(B139=B138,COUNTIF(B$9:B138,B139)+1,1))","v":127},0,0]
["132","-1900","-1900-128",null,null,null,null,null,null,null,null,null,null,null,null,null,null,null,null,null,null,{"$f":"IF(M$1019=1,\"\",IF(U140=\"\",\"\",VLOOKUP(U140,Tabelle!$B$4:$O$6,14,FALSE)))","v":""},{"$f":"IF(M$1019=1,\"\",IF(U140=\"\",\"\",VLOOKUP(U140,Tabelle!$B$4:$Q$6,16,FALSE)))","v":""},null,null,null,null,null,null,null,{"$f":"IF(B140=\"\",0,IF(B140=B139,COUNTIF(B$9:B139,B140)+1,1))","v":128},0,0]
["133","-1900","-1900-129",null,null,null,null,null,null,null,null,null,null,null,null,null,null,null,null,null,null,{"$f":"IF(M$1019=1,\"\",IF(U141=\"\",\"\",VLOOKUP(U141,Tabelle!$B$4:$O$6,14,FALSE)))","v":""},{"$f":"IF(M$1019=1,\"\",IF(U141=\"\",\"\",VLOOKUP(U141,Tabelle!$B$4:$Q$6,16,FALSE)))","v":""},null,null,null,null,null,null,null,{"$f":"IF(B141=\"\",0,IF(B141=B140,COUNTIF(B$9:B140,B141)+1,1))","v":129},0,0]
["134","-1900","-1900-130",null,null,null,null,null,null,null,null,null,null,null,null,null,null,null,null,null,null,{"$f":"IF(M$1019=1,\"\",IF(U142=\"\",\"\",VLOOKUP(U142,Tabelle!$B$4:$O$6,14,FALSE)))","v":""},{"$f":"IF(M$1019=1,\"\",IF(U142=\"\",\"\",VLOOKUP(U142,Tabelle!$B$4:$Q$6,16,FALSE)))","v":""},null,null,null,null,null,null,null,{"$f":"IF(B142=\"\",0,IF(B142=B141,COUNTIF(B$9:B141,B142)+1,1))","v":130},0,0]
["135","-1900","-1900-131",null,null,null,null,null,null,null,null,null,null,null,null,null,null,null,null,null,null,{"$f":"IF(M$1019=1,\"\",IF(U143=\"\",\"\",VLOOKUP(U143,Tabelle!$B$4:$O$6,14,FALSE)))","v":""},{"$f":"IF(M$1019=1,\"\",IF(U143=\"\",\"\",VLOOKUP(U143,Tabelle!$B$4:$Q$6,16,FALSE)))","v":""},null,null,null,null,null,null,null,{"$f":"IF(B143=\"\",0,IF(B143=B142,COUNTIF(B$9:B142,B143)+1,1))","v":131},0,0]
["136","-1900","-1900-132",null,null,null,null,null,null,null,null,null,null,null,null,null,null,null,null,null,null,{"$f":"IF(M$1019=1,\"\",IF(U144=\"\",\"\",VLOOKUP(U144,Tabelle!$B$4:$O$6,14,FALSE)))","v":""},{"$f":"IF(M$1019=1,\"\",IF(U144=\"\",\"\",VLOOKUP(U144,Tabelle!$B$4:$Q$6,16,FALSE)))","v":""},null,null,null,null,null,null,null,{"$f":"IF(B144=\"\",0,IF(B144=B143,COUNTIF(B$9:B143,B144)+1,1))","v":132},0,0]
["137","-1900","-1900-133",null,null,null,null,null,null,null,null,null,null,null,null,null,null,null,null,null,null,{"$f":"IF(M$1019=1,\"\",IF(U145=\"\",\"\",VLOOKUP(U145,Tabelle!$B$4:$O$6,14,FALSE)))","v":""},{"$f":"IF(M$1019=1,\"\",IF(U145=\"\",\"\",VLOOKUP(U145,Tabelle!$B$4:$Q$6,16,FALSE)))","v":""},null,null,null,null,null,null,null,{"$f":"IF(B145=\"\",0,IF(B145=B144,COUNTIF(B$9:B144,B145)+1,1))","v":133},0,0]
["138","-1900","-1900-134",null,null,null,null,null,null,null,null,null,null,null,null,null,null,null,null,null,null,{"$f":"IF(M$1019=1,\"\",IF(U146=\"\",\"\",VLOOKUP(U146,Tabelle!$B$4:$O$6,14,FALSE)))","v":""},{"$f":"IF(M$1019=1,\"\",IF(U146=\"\",\"\",VLOOKUP(U146,Tabelle!$B$4:$Q$6,16,FALSE)))","v":""},null,null,null,null,null,null,null,{"$f":"IF(B146=\"\",0,IF(B146=B145,COUNTIF(B$9:B145,B146)+1,1))","v":134},0,0]
["139","-1900","-1900-135",null,null,null,null,null,null,null,null,null,null,null,null,null,null,null,null,null,null,{"$f":"IF(M$1019=1,\"\",IF(U147=\"\",\"\",VLOOKUP(U147,Tabelle!$B$4:$O$6,14,FALSE)))","v":""},{"$f":"IF(M$1019=1,\"\",IF(U147=\"\",\"\",VLOOKUP(U147,Tabelle!$B$4:$Q$6,16,FALSE)))","v":""},null,null,null,null,null,null,null,{"$f":"IF(B147=\"\",0,IF(B147=B146,COUNTIF(B$9:B146,B147)+1,1))","v":135},0,0]
["140","-1900","-1900-136",null,null,null,null,null,null,null,null,null,null,null,null,null,null,null,null,null,null,{"$f":"IF(M$1019=1,\"\",IF(U148=\"\",\"\",VLOOKUP(U148,Tabelle!$B$4:$O$6,14,FALSE)))","v":""},{"$f":"IF(M$1019=1,\"\",IF(U148=\"\",\"\",VLOOKUP(U148,Tabelle!$B$4:$Q$6,16,FALSE)))","v":""},null,null,null,null,null,null,null,{"$f":"IF(B148=\"\",0,IF(B148=B147,COUNTIF(B$9:B147,B148)+1,1))","v":136},{"$f":"IF(OR(D148=\"\",M$1019=1),0,IF(AE148=8,1,0))","v":0},0]
["141","-1900","-1900-137",null,null,null,null,null,null,null,null,null,null,null,null,null,null,null,null,null,null,{"$f":"IF(M$1019=1,\"\",IF(U149=\"\",\"\",VLOOKUP(U149,Tabelle!$B$4:$O$6,14,FALSE)))","v":""},{"$f":"IF(M$1019=1,\"\",IF(U149=\"\",\"\",VLOOKUP(U149,Tabelle!$B$4:$Q$6,16,FALSE)))","v":""},null,null,null,null,null,null,null,{"$f":"IF(B149=\"\",0,IF(B149=B148,COUNTIF(B$9:B148,B149)+1,1))","v":137},0,0]
["142","-1900","-1900-138",null,null,null,null,null,null,null,null,null,null,null,null,null,null,null,null,null,null,{"$f":"IF(M$1019=1,\"\",IF(U150=\"\",\"\",VLOOKUP(U150,Tabelle!$B$4:$O$6,14,FALSE)))","v":""},{"$f":"IF(M$1019=1,\"\",IF(U150=\"\",\"\",VLOOKUP(U150,Tabelle!$B$4:$Q$6,16,FALSE)))","v":""},null,null,null,null,null,null,null,{"$f":"IF(B150=\"\",0,IF(B150=B149,COUNTIF(B$9:B149,B150)+1,1))","v":138},0,0]
["143","-1900","-1900-139",null,null,null,null,null,null,null,null,null,null,null,null,null,null,null,null,null,null,{"$f":"IF(M$1019=1,\"\",IF(U151=\"\",\"\",VLOOKUP(U151,Tabelle!$B$4:$O$6,14,FALSE)))","v":""},{"$f":"IF(M$1019=1,\"\",IF(U151=\"\",\"\",VLOOKUP(U151,Tabelle!$B$4:$Q$6,16,FALSE)))","v":""},null,null,null,null,null,null,null,{"$f":"IF(B151=\"\",0,IF(B151=B150,COUNTIF(B$9:B150,B151)+1,1))","v":139},0,0]
["144","-1900","-1900-140",null,null,null,null,null,null,null,null,null,null,null,null,null,null,null,null,null,null,{"$f":"IF(M$1019=1,\"\",IF(U152=\"\",\"\",VLOOKUP(U152,Tabelle!$B$4:$O$6,14,FALSE)))","v":""},{"$f":"IF(M$1019=1,\"\",IF(U152=\"\",\"\",VLOOKUP(U152,Tabelle!$B$4:$Q$6,16,FALSE)))","v":""},null,null,null,null,null,null,null,{"$f":"IF(B152=\"\",0,IF(B152=B151,COUNTIF(B$9:B151,B152)+1,1))","v":140},0,0]
["145","-1900","-1900-141",null,null,null,null,null,null,null,null,null,null,null,null,null,null,null,null,null,null,{"$f":"IF(M$1019=1,\"\",IF(U153=\"\",\"\",VLOOKUP(U153,Tabelle!$B$4:$O$6,14,FALSE)))","v":""},{"$f":"IF(M$1019=1,\"\",IF(U153=\"\",\"\",VLOOKUP(U153,Tabelle!$B$4:$Q$6,16,FALSE)))","v":""},null,null,null,null,null,null,null,{"$f":"IF(B153=\"\",0,IF(B153=B152,COUNTIF(B$9:B152,B153)+1,1))","v":141},0,0]
["146","-1900","-1900-142",null,null,null,null,null,null,null,null,null,null,null,null,null,null,null,null,null,null,{"$f":"IF(M$1019=1,\"\",IF(U154=\"\",\"\",VLOOKUP(U154,Tabelle!$B$4:$O$6,14,FALSE)))","v":""},{"$f":"IF(M$1019=1,\"\",IF(U154=\"\",\"\",VLOOKUP(U154,Tabelle!$B$4:$Q$6,16,FALSE)))","v":""},null,null,null,null,null,null,null,{"$f":"IF(B154=\"\",0,IF(B154=B153,COUNTIF(B$9:B153,B154)+1,1))","v":142},0,0]
["147","-1900","-1900-143",null,null,null,null,null,null,null,null,null,null,null,null,null,null,null,null,null,null,{"$f":"IF(M$1019=1,\"\",IF(U155=\"\",\"\",VLOOKUP(U155,Tabelle!$B$4:$O$6,14,FALSE)))","v":""},{"$f":"IF(M$1019=1,\"\",IF(U155=\"\",\"\",VLOOKUP(U155,Tabelle!$B$4:$Q$6,16,FALSE)))","v":""},null,null,null,null,null,null,null,{"$f":"IF(B155=\"\",0,IF(B155=B154,COUNTIF(B$9:B154,B155)+1,1))","v":143},0,0]
["148","-1900","-1900-144",null,null,null,null,null,null,null,null,null,null,null,null,null,null,null,null,null,null,{"$f":"IF(M$1019=1,\"\",IF(U156=\"\",\"\",VLOOKUP(U156,Tabelle!$B$4:$O$6,14,FALSE)))","v":""},{"$f":"IF(M$1019=1,\"\",IF(U156=\"\",\"\",VLOOKUP(U156,Tabelle!$B$4:$Q$6,16,FALSE)))","v":""},null,null,null,null,null,null,null,{"$f":"IF(B156=\"\",0,IF(B156=B155,COUNTIF(B$9:B155,B156)+1,1))","v":144},0,0]
["149","-1900","-1900-145",null,null,null,null,null,null,null,null,null,null,null,null,null,null,null,null,null,null,{"$f":"IF(M$1019=1,\"\",IF(U157=\"\",\"\",VLOOKUP(U157,Tabelle!$B$4:$O$6,14,FALSE)))","v":""},{"$f":"IF(M$1019=1,\"\",IF(U157=\"\",\"\",VLOOKUP(U157,Tabelle!$B$4:$Q$6,16,FALSE)))","v":""},null,null,null,null,null,null,null,{"$f":"IF(B157=\"\",0,IF(B157=B156,COUNTIF(B$9:B156,B157)+1,1))","v":145},0,0]
["150","-1900","-1900-146",null,null,null,null,null,null,null,null,null,null,null,null,null,null,null,null,null,null,{"$f":"IF(M$1019=1,\"\",IF(U158=\"\",\"\",VLOOKUP(U158,Tabelle!$B$4:$O$6,14,FALSE)))","v":""},{"$f":"IF(M$1019=1,\"\",IF(U158=\"\",\"\",VLOOKUP(U158,Tabelle!$B$4:$Q$6,16,FALSE)))","v":""},null,null,null,null,null,null,null,{"$f":"IF(B158=\"\",0,IF(B158=B157,COUNTIF(B$9:B157,B158)+1,1))","v":146},0,0]
["151","-1900","-1900-147",null,null,null,null,null,null,null,null,null,null,null,null,null,null,null,null,null,null,{"$f":"IF(M$1019=1,\"\",IF(U159=\"\",\"\",VLOOKUP(U159,Tabelle!$B$4:$O$6,14,FALSE)))","v":""},{"$f":"IF(M$1019=1,\"\",IF(U159=\"\",\"\",VLOOKUP(U159,Tabelle!$B$4:$Q$6,16,FALSE)))","v":""},null,null,null,null,null,null,null,{"$f":"IF(B159=\"\",0,IF(B159=B158,COUNTIF(B$9:B158,B159)+1,1))","v":147},0,0]
["152","-1900","-1900-148",null,null,null,null,null,null,null,null,null,null,null,null,null,null,null,null,null,null,{"$f":"IF(M$1019=1,\"\",IF(U160=\"\",\"\",VLOOKUP(U160,Tabelle!$B$4:$O$6,14,FALSE)))","v":""},{"$f":"IF(M$1019=1,\"\",IF(U160=\"\",\"\",VLOOKUP(U160,Tabelle!$B$4:$Q$6,16,FALSE)))","v":""},null,null,null,null,null,null,null,{"$f":"IF(B160=\"\",0,IF(B160=B159,COUNTIF(B$9:B159,B160)+1,1))","v":148},0,0]
["153","-1900","-1900-149",null,null,null,null,null,null,null,null,null,null,null,null,null,null,null,null,null,null,{"$f":"IF(M$1019=1,\"\",IF(U161=\"\",\"\",VLOOKUP(U161,Tabelle!$B$4:$O$6,14,FALSE)))","v":""},{"$f":"IF(M$1019=1,\"\",IF(U161=\"\",\"\",VLOOKUP(U161,Tabelle!$B$4:$Q$6,16,FALSE)))","v":""},null,null,null,null,null,null,null,{"$f":"IF(B161=\"\",0,IF(B161=B160,COUNTIF(B$9:B160,B161)+1,1))","v":149},0,0]
["154","-1900","-1900-150",null,null,null,null,null,null,null,null,null,null,null,null,null,null,null,null,null,null,{"$f":"IF(M$1019=1,\"\",IF(U162=\"\",\"\",VLOOKUP(U162,Tabelle!$B$4:$O$6,14,FALSE)))","v":""},{"$f":"IF(M$1019=1,\"\",IF(U162=\"\",\"\",VLOOKUP(U162,Tabelle!$B$4:$Q$6,16,FALSE)))","v":""},null,null,null,null,null,null,null,{"$f":"IF(B162=\"\",0,IF(B162=B161,COUNTIF(B$9:B161,B162)+1,1))","v":150},0,0]
["155","-1900","-1900-151",null,null,null,null,null,null,null,null,null,null,null,null,null,null,null,null,null,null,{"$f":"IF(M$1019=1,\"\",IF(U163=\"\",\"\",VLOOKUP(U163,Tabelle!$B$4:$O$6,14,FALSE)))","v":""},{"$f":"IF(M$1019=1,\"\",IF(U163=\"\",\"\",VLOOKUP(U163,Tabelle!$B$4:$Q$6,16,FALSE)))","v":""},null,null,null,null,null,null,null,{"$f":"IF(B163=\"\",0,IF(B163=B162,COUNTIF(B$9:B162,B163)+1,1))","v":151},0,0]
["156","-1900","-1900-152",null,null,null,null,null,null,null,null,null,null,null,null,null,null,null,null,null,null,{"$f":"IF(M$1019=1,\"\",IF(U164=\"\",\"\",VLOOKUP(U164,Tabelle!$B$4:$O$6,14,FALSE)))","v":""},{"$f":"IF(M$1019=1,\"\",IF(U164=\"\",\"\",VLOOKUP(U164,Tabelle!$B$4:$Q$6,16,FALSE)))","v":""},null,null,null,null,null,null,null,{"$f":"IF(B164=\"\",0,IF(B164=B163,COUNTIF(B$9:B163,B164)+1,1))","v":152},0,0]
["157","-1900","-1900-153",null,null,null,null,null,null,null,null,null,null,null,null,null,null,null,null,null,null,{"$f":"IF(M$1019=1,\"\",IF(U165=\"\",\"\",VLOOKUP(U165,Tabelle!$B$4:$O$6,14,FALSE)))","v":""},{"$f":"IF(M$1019=1,\"\",IF(U165=\"\",\"\",VLOOKUP(U165,Tabelle!$B$4:$Q$6,16,FALSE)))","v":""},null,null,null,null,null,null,null,{"$f":"IF(B165=\"\",0,IF(B165=B164,COUNTIF(B$9:B164,B165)+1,1))","v":153},0,0]
["158","-1900","-1900-154",null,null,null,null,null,null,null,null,null,null,null,null,null,null,null,null,null,null,{"$f":"IF(M$1019=1,\"\",IF(U166=\"\",\"\",VLOOKUP(U166,Tabelle!$B$4:$O$6,14,FALSE)))","v":""},{"$f":"IF(M$1019=1,\"\",IF(U166=\"\",\"\",VLOOKUP(U166,Tabelle!$B$4:$Q$6,16,FALSE)))","v":""},null,null,null,null,null,null,null,{"$f":"IF(B166=\"\",0,IF(B166=B165,COUNTIF(B$9:B165,B166)+1,1))","v":154},0,0]
["159","-1900","-1900-155",null,null,null,null,null,null,null,null,null,null,null,null,null,null,null,null,null,null,{"$f":"IF(M$1019=1,\"\",IF(U167=\"\",\"\",VLOOKUP(U167,Tabelle!$B$4:$O$6,14,FALSE)))","v":""},{"$f":"IF(M$1019=1,\"\",IF(U167=\"\",\"\",VLOOKUP(U167,Tabelle!$B$4:$Q$6,16,FALSE)))","v":""},null,null,null,null,null,null,null,{"$f":"IF(B167=\"\",0,IF(B167=B166,COUNTIF(B$9:B166,B167)+1,1))","v":155},0,0]
["160","-1900","-1900-156",null,null,null,null,null,null,null,null,null,null,null,null,null,null,null,null,null,null,{"$f":"IF(M$1019=1,\"\",IF(U168=\"\",\"\",VLOOKUP(U168,Tabelle!$B$4:$O$6,14,FALSE)))","v":""},{"$f":"IF(M$1019=1,\"\",IF(U168=\"\",\"\",VLOOKUP(U168,Tabelle!$B$4:$Q$6,16,FALSE)))","v":""},null,null,null,null,null,null,null,{"$f":"IF(B168=\"\",0,IF(B168=B167,COUNTIF(B$9:B167,B168)+1,1))","v":156},0,0]
["161","-1900","-1900-157",null,null,null,null,null,null,null,null,null,null,null,null,null,null,null,null,null,null,{"$f":"IF(M$1019=1,\"\",IF(U169=\"\",\"\",VLOOKUP(U169,Tabelle!$B$4:$O$6,14,FALSE)))","v":""},{"$f":"IF(M$1019=1,\"\",IF(U169=\"\",\"\",VLOOKUP(U169,Tabelle!$B$4:$Q$6,16,FALSE)))","v":""},null,null,null,null,null,null,null,{"$f":"IF(B169=\"\",0,IF(B169=B168,COUNTIF(B$9:B168,B169)+1,1))","v":157},0,0]
["162","-1900","-1900-158",null,null,null,null,null,null,null,null,null,null,null,null,null,null,null,null,null,null,{"$f":"IF(M$1019=1,\"\",IF(U170=\"\",\"\",VLOOKUP(U170,Tabelle!$B$4:$O$6,14,FALSE)))","v":""},{"$f":"IF(M$1019=1,\"\",IF(U170=\"\",\"\",VLOOKUP(U170,Tabelle!$B$4:$Q$6,16,FALSE)))","v":""},null,null,null,null,null,null,null,{"$f":"IF(B170=\"\",0,IF(B170=B169,COUNTIF(B$9:B169,B170)+1,1))","v":158},0,0]
["163","-1900","-1900-159",null,null,null,null,null,null,null,null,null,null,null,null,null,null,null,null,null,null,{"$f":"IF(M$1019=1,\"\",IF(U171=\"\",\"\",VLOOKUP(U171,Tabelle!$B$4:$O$6,14,FALSE)))","v":""},{"$f":"IF(M$1019=1,\"\",IF(U171=\"\",\"\",VLOOKUP(U171,Tabelle!$B$4:$Q$6,16,FALSE)))","v":""},null,null,null,null,null,null,null,{"$f":"IF(B171=\"\",0,IF(B171=B170,COUNTIF(B$9:B170,B171)+1,1))","v":159},0,0]
["164","-1900","-1900-160",null,null,null,null,null,null,null,null,null,null,null,null,null,null,null,null,null,null,{"$f":"IF(M$1019=1,\"\",IF(U172=\"\",\"\",VLOOKUP(U172,Tabelle!$B$4:$O$6,14,FALSE)))","v":""},{"$f":"IF(M$1019=1,\"\",IF(U172=\"\",\"\",VLOOKUP(U172,Tabelle!$B$4:$Q$6,16,FALSE)))","v":""},null,null,null,null,null,null,null,{"$f":"IF(B172=\"\",0,IF(B172=B171,COUNTIF(B$9:B171,B172)+1,1))","v":160},0,0]
["165","-1900","-1900-161",null,null,null,null,null,null,null,null,null,null,null,null,null,null,null,null,null,null,{"$f":"IF(M$1019=1,\"\",IF(U173=\"\",\"\",VLOOKUP(U173,Tabelle!$B$4:$O$6,14,FALSE)))","v":""},{"$f":"IF(M$1019=1,\"\",IF(U173=\"\",\"\",VLOOKUP(U173,Tabelle!$B$4:$Q$6,16,FALSE)))","v":""},null,null,null,null,null,null,null,{"$f":"IF(B173=\"\",0,IF(B173=B172,COUNTIF(B$9:B172,B173)+1,1))","v":161},0,0]
["166","-1900","-1900-162",null,null,null,null,null,null,null,null,null,null,null,null,null,null,null,null,null,null,{"$f":"IF(M$1019=1,\"\",IF(U174=\"\",\"\",VLOOKUP(U174,Tabelle!$B$4:$O$6,14,FALSE)))","v":""},{"$f":"IF(M$1019=1,\"\",IF(U174=\"\",\"\",VLOOKUP(U174,Tabelle!$B$4:$Q$6,16,FALSE)))","v":""},null,null,null,null,null,null,null,{"$f":"IF(B174=\"\",0,IF(B174=B173,COUNTIF(B$9:B173,B174)+1,1))","v":162},0,0]
["167","-1900","-1900-163",null,null,null,null,null,null,null,null,null,null,null,null,null,null,null,null,null,null,{"$f":"IF(M$1019=1,\"\",IF(U175=\"\",\"\",VLOOKUP(U175,Tabelle!$B$4:$O$6,14,FALSE)))","v":""},{"$f":"IF(M$1019=1,\"\",IF(U175=\"\",\"\",VLOOKUP(U175,Tabelle!$B$4:$Q$6,16,FALSE)))","v":""},null,null,null,null,null,null,null,{"$f":"IF(B175=\"\",0,IF(B175=B174,COUNTIF(B$9:B174,B175)+1,1))","v":163},0,0]
["168","-1900","-1900-164",null,null,null,null,null,null,null,null,null,null,null,null,null,null,null,null,null,null,{"$f":"IF(M$1019=1,\"\",IF(U176=\"\",\"\",VLOOKUP(U176,Tabelle!$B$4:$O$6,14,FALSE)))","v":""},{"$f":"IF(M$1019=1,\"\",IF(U176=\"\",\"\",VLOOKUP(U176,Tabelle!$B$4:$Q$6,16,FALSE)))","v":""},null,null,null,null,null,null,null,{"$f":"IF(B176=\"\",0,IF(B176=B175,COUNTIF(B$9:B175,B176)+1,1))","v":164},0,0]
["169","-1900","-1900-165",null,null,null,null,null,null,null,null,null,null,null,null,null,null,null,null,null,null,{"$f":"IF(M$1019=1,\"\",IF(U177=\"\",\"\",VLOOKUP(U177,Tabelle!$B$4:$O$6,14,FALSE)))","v":""},{"$f":"IF(M$1019=1,\"\",IF(U177=\"\",\"\",VLOOKUP(U177,Tabelle!$B$4:$Q$6,16,FALSE)))","v":""},null,null,null,null,null,null,null,{"$f":"IF(B177=\"\",0,IF(B177=B176,COUNTIF(B$9:B176,B177)+1,1))","v":165},0,0]
["170","-1900","-1900-166",null,null,null,null,null,null,null,null,null,null,null,null,null,null,null,null,null,null,{"$f":"IF(M$1019=1,\"\",IF(U178=\"\",\"\",VLOOKUP(U178,Tabelle!$B$4:$O$6,14,FALSE)))","v":""},{"$f":"IF(M$1019=1,\"\",IF(U178=\"\",\"\",VLOOKUP(U178,Tabelle!$B$4:$Q$6,16,FALSE)))","v":""},null,null,null,null,null,null,null,{"$f":"IF(B178=\"\",0,IF(B178=B177,COUNTIF(B$9:B177,B178)+1,1))","v":166},0,0]
["171","-1900","-1900-167",null,null,null,null,null,null,null,null,null,null,null,null,null,null,null,null,null,null,{"$f":"IF(M$1019=1,\"\",IF(U179=\"\",\"\",VLOOKUP(U179,Tabelle!$B$4:$O$6,14,FALSE)))","v":""},{"$f":"IF(M$1019=1,\"\",IF(U179=\"\",\"\",VLOOKUP(U179,Tabelle!$B$4:$Q$6,16,FALSE)))","v":""},null,null,null,null,null,null,null,{"$f":"IF(B179=\"\",0,IF(B179=B178,COUNTIF(B$9:B178,B179)+1,1))","v":167},0,0]
["172","-1900","-1900-168",null,null,null,null,null,null,null,null,null,null,null,null,null,null,null,null,null,null,{"$f":"IF(M$1019=1,\"\",IF(U180=\"\",\"\",VLOOKUP(U180,Tabelle!$B$4:$O$6,14,FALSE)))","v":""},{"$f":"IF(M$1019=1,\"\",IF(U180=\"\",\"\",VLOOKUP(U180,Tabelle!$B$4:$Q$6,16,FALSE)))","v":""},null,null,null,null,null,null,null,{"$f":"IF(B180=\"\",0,IF(B180=B179,COUNTIF(B$9:B179,B180)+1,1))","v":168},0,0]
["173","-1900","-1900-169",null,null,null,null,null,null,null,null,null,null,null,null,null,null,null,null,null,null,{"$f":"IF(M$1019=1,\"\",IF(U181=\"\",\"\",VLOOKUP(U181,Tabelle!$B$4:$O$6,14,FALSE)))","v":""},{"$f":"IF(M$1019=1,\"\",IF(U181=\"\",\"\",VLOOKUP(U181,Tabelle!$B$4:$Q$6,16,FALSE)))","v":""},null,null,null,null,null,null,null,{"$f":"IF(B181=\"\",0,IF(B181=B180,COUNTIF(B$9:B180,B181)+1,1))","v":169},0,0]
["174","-1900","-1900-170",null,null,null,null,null,null,null,null,null,null,null,null,null,null,null,null,null,null,{"$f":"IF(M$1019=1,\"\",IF(U182=\"\",\"\",VLOOKUP(U182,Tabelle!$B$4:$O$6,14,FALSE)))","v":""},{"$f":"IF(M$1019=1,\"\",IF(U182=\"\",\"\",VLOOKUP(U182,Tabelle!$B$4:$Q$6,16,FALSE)))","v":""},null,null,null,null,null,null,null,{"$f":"IF(B182=\"\",0,IF(B182=B181,COUNTIF(B$9:B181,B182)+1,1))","v":170},0,0]
["175","-1900","-1900-171",null,null,null,null,null,null,null,null,null,null,null,null,null,null,null,null,null,null,{"$f":"IF(M$1019=1,\"\",IF(U183=\"\",\"\",VLOOKUP(U183,Tabelle!$B$4:$O$6,14,FALSE)))","v":""},{"$f":"IF(M$1019=1,\"\",IF(U183=\"\",\"\",VLOOKUP(U183,Tabelle!$B$4:$Q$6,16,FALSE)))","v":""},null,null,null,null,null,null,null,{"$f":"IF(B183=\"\",0,IF(B183=B182,COUNTIF(B$9:B182,B183)+1,1))","v":171},0,0]
["176","-1900","-1900-172",null,null,null,null,null,null,null,null,null,null,null,null,null,null,null,null,null,null,{"$f":"IF(M$1019=1,\"\",IF(U184=\"\",\"\",VLOOKUP(U184,Tabelle!$B$4:$O$6,14,FALSE)))","v":""},{"$f":"IF(M$1019=1,\"\",IF(U184=\"\",\"\",VLOOKUP(U184,Tabelle!$B$4:$Q$6,16,FALSE)))","v":""},null,null,null,null,null,null,null,{"$f":"IF(B184=\"\",0,IF(B184=B183,COUNTIF(B$9:B183,B184)+1,1))","v":172},0,0]
["177","-1900","-1900-173",null,null,null,null,null,null,null,null,null,null,null,null,null,null,null,null,null,null,{"$f":"IF(M$1019=1,\"\",IF(U185=\"\",\"\",VLOOKUP(U185,Tabelle!$B$4:$O$6,14,FALSE)))","v":""},{"$f":"IF(M$1019=1,\"\",IF(U185=\"\",\"\",VLOOKUP(U185,Tabelle!$B$4:$Q$6,16,FALSE)))","v":""},null,null,null,null,null,null,null,{"$f":"IF(B185=\"\",0,IF(B185=B184,COUNTIF(B$9:B184,B185)+1,1))","v":173},0,0]
["178","-1900","-1900-174",null,null,null,null,null,null,null,null,null,null,null,null,null,null,null,null,null,null,{"$f":"IF(M$1019=1,\"\",IF(U186=\"\",\"\",VLOOKUP(U186,Tabelle!$B$4:$O$6,14,FALSE)))","v":""},{"$f":"IF(M$1019=1,\"\",IF(U186=\"\",\"\",VLOOKUP(U186,Tabelle!$B$4:$Q$6,16,FALSE)))","v":""},null,null,null,null,null,null,null,{"$f":"IF(B186=\"\",0,IF(B186=B185,COUNTIF(B$9:B185,B186)+1,1))","v":174},0,0]
["179","-1900","-1900-175",null,null,null,null,null,null,null,null,null,null,null,null,null,null,null,null,null,null,{"$f":"IF(M$1019=1,\"\",IF(U187=\"\",\"\",VLOOKUP(U187,Tabelle!$B$4:$O$6,14,FALSE)))","v":""},{"$f":"IF(M$1019=1,\"\",IF(U187=\"\",\"\",VLOOKUP(U187,Tabelle!$B$4:$Q$6,16,FALSE)))","v":""},null,null,null,null,null,null,null,{"$f":"IF(B187=\"\",0,IF(B187=B186,COUNTIF(B$9:B186,B187)+1,1))","v":175},0,0]
["180","-1900","-1900-176",null,null,null,null,null,null,null,null,null,null,null,null,null,null,null,null,null,null,{"$f":"IF(M$1019=1,\"\",IF(U188=\"\",\"\",VLOOKUP(U188,Tabelle!$B$4:$O$6,14,FALSE)))","v":""},{"$f":"IF(M$1019=1,\"\",IF(U188=\"\",\"\",VLOOKUP(U188,Tabelle!$B$4:$Q$6,16,FALSE)))","v":""},null,null,null,null,null,null,null,{"$f":"IF(B188=\"\",0,IF(B188=B187,COUNTIF(B$9:B187,B188)+1,1))","v":176},0,0]
["181","-1900","-1900-177",null,null,null,null,null,null,null,null,null,null,null,null,null,null,null,null,null,null,{"$f":"IF(M$1019=1,\"\",IF(U189=\"\",\"\",VLOOKUP(U189,Tabelle!$B$4:$O$6,14,FALSE)))","v":""},{"$f":"IF(M$1019=1,\"\",IF(U189=\"\",\"\",VLOOKUP(U189,Tabelle!$B$4:$Q$6,16,FALSE)))","v":""},null,null,null,null,null,null,null,{"$f":"IF(B189=\"\",0,IF(B189=B188,COUNTIF(B$9:B188,B189)+1,1))","v":177},0,0]
["182","-1900","-1900-178",null,null,null,null,null,null,null,null,null,null,null,null,null,null,null,null,null,null,{"$f":"IF(M$1019=1,\"\",IF(U190=\"\",\"\",VLOOKUP(U190,Tabelle!$B$4:$O$6,14,FALSE)))","v":""},{"$f":"IF(M$1019=1,\"\",IF(U190=\"\",\"\",VLOOKUP(U190,Tabelle!$B$4:$Q$6,16,FALSE)))","v":""},null,null,null,null,null,null,null,{"$f":"IF(B190=\"\",0,IF(B190=B189,COUNTIF(B$9:B189,B190)+1,1))","v":178},0,0]
["183","-1900","-1900-179",null,null,null,null,null,null,null,null,null,null,null,null,null,null,null,null,null,null,{"$f":"IF(M$1019=1,\"\",IF(U191=\"\",\"\",VLOOKUP(U191,Tabelle!$B$4:$O$6,14,FALSE)))","v":""},{"$f":"IF(M$1019=1,\"\",IF(U191=\"\",\"\",VLOOKUP(U191,Tabelle!$B$4:$Q$6,16,FALSE)))","v":""},null,null,null,null,null,null,null,{"$f":"IF(B191=\"\",0,IF(B191=B190,COUNTIF(B$9:B190,B191)+1,1))","v":179},0,0]
["184","-1900","-1900-180",null,null,null,null,null,null,null,null,null,null,null,null,null,null,null,null,null,null,{"$f":"IF(M$1019=1,\"\",IF(U192=\"\",\"\",VLOOKUP(U192,Tabelle!$B$4:$O$6,14,FALSE)))","v":""},{"$f":"IF(M$1019=1,\"\",IF(U192=\"\",\"\",VLOOKUP(U192,Tabelle!$B$4:$Q$6,16,FALSE)))","v":""},null,null,null,null,null,null,null,{"$f":"IF(B192=\"\",0,IF(B192=B191,COUNTIF(B$9:B191,B192)+1,1))","v":180},0,0]
["185","-1900","-1900-181",null,null,null,null,null,null,null,null,null,null,null,null,null,null,null,null,null,null,{"$f":"IF(M$1019=1,\"\",IF(U193=\"\",\"\",VLOOKUP(U193,Tabelle!$B$4:$O$6,14,FALSE)))","v":""},{"$f":"IF(M$1019=1,\"\",IF(U193=\"\",\"\",VLOOKUP(U193,Tabelle!$B$4:$Q$6,16,FALSE)))","v":""},null,null,null,null,null,null,null,{"$f":"IF(B193=\"\",0,IF(B193=B192,COUNTIF(B$9:B192,B193)+1,1))","v":181},0,0]
["186","-1900","-1900-182",null,null,null,null,null,null,null,null,null,null,null,null,null,null,null,null,null,null,{"$f":"IF(M$1019=1,\"\",IF(U194=\"\",\"\",VLOOKUP(U194,Tabelle!$B$4:$O$6,14,FALSE)))","v":""},{"$f":"IF(M$1019=1,\"\",IF(U194=\"\",\"\",VLOOKUP(U194,Tabelle!$B$4:$Q$6,16,FALSE)))","v":""},null,null,null,null,null,null,null,{"$f":"IF(B194=\"\",0,IF(B194=B193,COUNTIF(B$9:B193,B194)+1,1))","v":182},0,0]
["187","-1900","-1900-183",null,null,null,null,null,null,null,null,null,null,null,null,null,null,null,null,null,null,{"$f":"IF(M$1019=1,\"\",IF(U195=\"\",\"\",VLOOKUP(U195,Tabelle!$B$4:$O$6,14,FALSE)))","v":""},{"$f":"IF(M$1019=1,\"\",IF(U195=\"\",\"\",VLOOKUP(U195,Tabelle!$B$4:$Q$6,16,FALSE)))","v":""},null,null,null,null,null,null,null,{"$f":"IF(B195=\"\",0,IF(B195=B194,COUNTIF(B$9:B194,B195)+1,1))","v":183},0,0]
["188","-1900","-1900-184",null,null,null,null,null,null,null,null,null,null,null,null,null,null,null,null,null,null,{"$f":"IF(M$1019=1,\"\",IF(U196=\"\",\"\",VLOOKUP(U196,Tabelle!$B$4:$O$6,14,FALSE)))","v":""},{"$f":"IF(M$1019=1,\"\",IF(U196=\"\",\"\",VLOOKUP(U196,Tabelle!$B$4:$Q$6,16,FALSE)))","v":""},null,null,null,null,null,null,null,{"$f":"IF(B196=\"\",0,IF(B196=B195,COUNTIF(B$9:B195,B196)+1,1))","v":184},0,0]
["189","-1900","-1900-185",null,null,null,null,null,null,null,null,null,null,null,null,null,null,null,null,null,null,{"$f":"IF(M$1019=1,\"\",IF(U197=\"\",\"\",VLOOKUP(U197,Tabelle!$B$4:$O$6,14,FALSE)))","v":""},{"$f":"IF(M$1019=1,\"\",IF(U197=\"\",\"\",VLOOKUP(U197,Tabelle!$B$4:$Q$6,16,FALSE)))","v":""},null,null,null,null,null,null,null,{"$f":"IF(B197=\"\",0,IF(B197=B196,COUNTIF(B$9:B196,B197)+1,1))","v":185},0,0]
["190","-1900","-1900-186",null,null,null,null,null,null,null,null,null,null,null,null,null,null,null,null,null,null,{"$f":"IF(M$1019=1,\"\",IF(U198=\"\",\"\",VLOOKUP(U198,Tabelle!$B$4:$O$6,14,FALSE)))","v":""},{"$f":"IF(M$1019=1,\"\",IF(U198=\"\",\"\",VLOOKUP(U198,Tabelle!$B$4:$Q$6,16,FALSE)))","v":""},null,null,null,null,null,null,null,{"$f":"IF(B198=\"\",0,IF(B198=B197,COUNTIF(B$9:B197,B198)+1,1))","v":186},0,0]
["191","-1900","-1900-187",null,null,null,null,null,null,null,null,null,null,null,null,null,null,null,null,null,null,{"$f":"IF(M$1019=1,\"\",IF(U199=\"\",\"\",VLOOKUP(U199,Tabelle!$B$4:$O$6,14,FALSE)))","v":""},{"$f":"IF(M$1019=1,\"\",IF(U199=\"\",\"\",VLOOKUP(U199,Tabelle!$B$4:$Q$6,16,FALSE)))","v":""},null,null,null,null,null,null,null,{"$f":"IF(B199=\"\",0,IF(B199=B198,COUNTIF(B$9:B198,B199)+1,1))","v":187},0,0]
["192","-1900","-1900-188",null,null,null,null,null,null,null,null,null,null,null,null,null,null,null,null,null,null,{"$f":"IF(M$1019=1,\"\",IF(U200=\"\",\"\",VLOOKUP(U200,Tabelle!$B$4:$O$6,14,FALSE)))","v":""},{"$f":"IF(M$1019=1,\"\",IF(U200=\"\",\"\",VLOOKUP(U200,Tabelle!$B$4:$Q$6,16,FALSE)))","v":""},null,null,null,null,null,null,null,{"$f":"IF(B200=\"\",0,IF(B200=B199,COUNTIF(B$9:B199,B200)+1,1))","v":188},0,0]
["193","-1900",{"$f":"IF(M$1019=1,0,B201&\"-\"&AE201)","v":"-1900-189"},null,null,null,null,null,null,null,null,null,null,null,null,null,null,null,null,null,null,{"$f":"IF(M$1019=1,\"\",IF(U201=\"\",\"\",VLOOKUP(U201,Tabelle!$B$4:$O$6,14,FALSE)))","v":""},{"$f":"IF(M$1019=1,\"\",IF(U201=\"\",\"\",VLOOKUP(U201,Tabelle!$B$4:$Q$6,16,FALSE)))","v":""},null,null,null,null,null,null,null,{"$f":"IF(B201=\"\",0,IF(B201=B200,COUNTIF(B$9:B200,B201)+1,1))","v":189},0,0]
["194",{"$f":"IF(AG202=$AG$1013,0,IF(M$1019=1,0,D202&\"-\"&YEAR(E202)))","v":"-1900"},"-1900-190",null,null,null,null,null,null,null,null,null,null,null,null,null,null,null,null,null,null,{"$f":"IF(M$1019=1,\"\",IF(U202=\"\",\"\",VLOOKUP(U202,Tabelle!$B$4:$O$6,14,FALSE)))","v":""},{"$f":"IF(M$1019=1,\"\",IF(U202=\"\",\"\",VLOOKUP(U202,Tabelle!$B$4:$Q$6,16,FALSE)))","v":""},null,null,null,null,null,null,null,{"$f":"IF(B202=\"\",0,IF(B202=B201,COUNTIF(B$9:B201,B202)+1,1))","v":190},0,{"$f":"IF(E202>0,IF(OR(MONTH(E202)<$L$1030,MONTH(E202)>$L$1031),AG$1013,0),0)","v":0}]
["195","-1900","-1900-191",null,null,null,null,null,null,null,null,null,null,null,null,null,null,null,null,null,null,{"$f":"IF(M$1019=1,\"\",IF(U203=\"\",\"\",VLOOKUP(U203,Tabelle!$B$4:$O$6,14,FALSE)))","v":""},{"$f":"IF(M$1019=1,\"\",IF(U203=\"\",\"\",VLOOKUP(U203,Tabelle!$B$4:$Q$6,16,FALSE)))","v":""},null,null,null,null,null,null,null,{"$f":"IF(B203=\"\",0,IF(B203=B202,COUNTIF(B$9:B202,B203)+1,1))","v":191},0,0]
["196","-1900","-1900-192",null,null,null,null,null,null,null,null,null,null,null,null,null,null,null,null,null,null,{"$f":"IF(M$1019=1,\"\",IF(U204=\"\",\"\",VLOOKUP(U204,Tabelle!$B$4:$O$6,14,FALSE)))","v":""},{"$f":"IF(M$1019=1,\"\",IF(U204=\"\",\"\",VLOOKUP(U204,Tabelle!$B$4:$Q$6,16,FALSE)))","v":""},null,null,null,null,null,null,null,{"$f":"IF(B204=\"\",0,IF(B204=B203,COUNTIF(B$9:B203,B204)+1,1))","v":192},0,0]
["197","-1900","-1900-193",null,null,null,null,null,null,null,null,null,null,null,null,null,null,null,null,null,null,{"$f":"IF(M$1019=1,\"\",IF(U205=\"\",\"\",VLOOKUP(U205,Tabelle!$B$4:$O$6,14,FALSE)))","v":""},{"$f":"IF(M$1019=1,\"\",IF(U205=\"\",\"\",VLOOKUP(U205,Tabelle!$B$4:$Q$6,16,FALSE)))","v":""},null,null,null,null,null,null,null,{"$f":"IF(B205=\"\",0,IF(B205=B204,COUNTIF(B$9:B204,B205)+1,1))","v":193},0,0]
["198","-1900","-1900-194",null,null,null,null,null,null,null,null,null,null,null,null,null,null,null,null,null,null,{"$f":"IF(M$1019=1,\"\",IF(U206=\"\",\"\",VLOOKUP(U206,Tabelle!$B$4:$O$6,14,FALSE)))","v":""},{"$f":"IF(M$1019=1,\"\",IF(U206=\"\",\"\",VLOOKUP(U206,Tabelle!$B$4:$Q$6,16,FALSE)))","v":""},null,null,null,null,null,null,null,{"$f":"IF(B206=\"\",0,IF(B206=B205,COUNTIF(B$9:B205,B206)+1,1))","v":194},0,0]
["199","-1900","-1900-195",null,null,null,null,null,null,null,null,null,null,null,null,null,null,null,null,null,null,{"$f":"IF(M$1019=1,\"\",IF(U207=\"\",\"\",VLOOKUP(U207,Tabelle!$B$4:$O$6,14,FALSE)))","v":""},{"$f":"IF(M$1019=1,\"\",IF(U207=\"\",\"\",VLOOKUP(U207,Tabelle!$B$4:$Q$6,16,FALSE)))","v":""},null,null,null,null,null,null,null,{"$f":"IF(B207=\"\",0,IF(B207=B206,COUNTIF(B$9:B206,B207)+1,1))","v":195},0,0]
["200","-1900","-1900-196",null,null,null,null,null,null,null,null,null,null,null,null,null,null,null,null,null,null,{"$f":"IF(M$1019=1,\"\",IF(U208=\"\",\"\",VLOOKUP(U208,Tabelle!$B$4:$O$6,14,FALSE)))","v":""},{"$f":"IF(M$1019=1,\"\",IF(U208=\"\",\"\",VLOOKUP(U208,Tabelle!$B$4:$Q$6,16,FALSE)))","v":""},null,null,null,null,null,null,null,{"$f":"IF(B208=\"\",0,IF(B208=B207,COUNTIF(B$9:B207,B208)+1,1))","v":196},0,0]
["201","-1900","-1900-197",null,null,null,null,null,null,null,null,null,null,null,null,null,null,null,null,null,null,{"$f":"IF(M$1019=1,\"\",IF(U209=\"\",\"\",VLOOKUP(U209,Tabelle!$B$4:$O$6,14,FALSE)))","v":""},{"$f":"IF(M$1019=1,\"\",IF(U209=\"\",\"\",VLOOKUP(U209,Tabelle!$B$4:$Q$6,16,FALSE)))","v":""},null,null,null,null,null,null,null,{"$f":"IF(B209=\"\",0,IF(B209=B208,COUNTIF(B$9:B208,B209)+1,1))","v":197},0,0]
["202","-1900","-1900-198",null,null,null,null,null,null,null,null,null,null,null,null,null,null,null,null,null,null,{"$f":"IF(M$1019=1,\"\",IF(U210=\"\",\"\",VLOOKUP(U210,Tabelle!$B$4:$O$6,14,FALSE)))","v":""},{"$f":"IF(M$1019=1,\"\",IF(U210=\"\",\"\",VLOOKUP(U210,Tabelle!$B$4:$Q$6,16,FALSE)))","v":""},null,null,null,null,null,null,null,{"$f":"IF(B210=\"\",0,IF(B210=B209,COUNTIF(B$9:B209,B210)+1,1))","v":198},0,0]
["203","-1900","-1900-199",null,null,null,null,null,null,null,null,null,null,null,null,null,null,null,null,null,null,{"$f":"IF(M$1019=1,\"\",IF(U211=\"\",\"\",VLOOKUP(U211,Tabelle!$B$4:$O$6,14,FALSE)))","v":""},{"$f":"IF(M$1019=1,\"\",IF(U211=\"\",\"\",VLOOKUP(U211,Tabelle!$B$4:$Q$6,16,FALSE)))","v":""},null,null,null,null,null,null,null,{"$f":"IF(B211=\"\",0,IF(B211=B210,COUNTIF(B$9:B210,B211)+1,1))","v":199},0,0]
["204","-1900","-1900-200",null,null,null,null,null,null,null,null,null,null,null,null,null,null,null,null,null,null,{"$f":"IF(M$1019=1,\"\",IF(U212=\"\",\"\",VLOOKUP(U212,Tabelle!$B$4:$O$6,14,FALSE)))","v":""},{"$f":"IF(M$1019=1,\"\",IF(U212=\"\",\"\",VLOOKUP(U212,Tabelle!$B$4:$Q$6,16,FALSE)))","v":""},null,null,null,null,null,null,null,{"$f":"IF(B212=\"\",0,IF(B212=B211,COUNTIF(B$9:B211,B212)+1,1))","v":200},{"$f":"IF(OR(D212=\"\",M$1019=1),0,IF(AE212=8,1,0))","v":0},0]
["205","-1900","-1900-201",null,null,null,null,null,null,null,null,null,null,null,null,null,null,null,null,null,null,{"$f":"IF(M$1019=1,\"\",IF(U213=\"\",\"\",VLOOKUP(U213,Tabelle!$B$4:$O$6,14,FALSE)))","v":""},{"$f":"IF(M$1019=1,\"\",IF(U213=\"\",\"\",VLOOKUP(U213,Tabelle!$B$4:$Q$6,16,FALSE)))","v":""},null,null,null,null,null,null,null,{"$f":"IF(B213=\"\",0,IF(B213=B212,COUNTIF(B$9:B212,B213)+1,1))","v":201},0,0]
["206","-1900","-1900-202",null,null,null,null,null,null,null,null,null,null,null,null,null,null,null,null,null,null,{"$f":"IF(M$1019=1,\"\",IF(U214=\"\",\"\",VLOOKUP(U214,Tabelle!$B$4:$O$6,14,FALSE)))","v":""},{"$f":"IF(M$1019=1,\"\",IF(U214=\"\",\"\",VLOOKUP(U214,Tabelle!$B$4:$Q$6,16,FALSE)))","v":""},null,null,null,null,null,null,null,{"$f":"IF(B214=\"\",0,IF(B214=B213,COUNTIF(B$9:B213,B214)+1,1))","v":202},0,0]
["207","-1900","-1900-203",null,null,null,null,null,null,null,null,null,null,null,null,null,null,null,null,null,null,{"$f":"IF(M$1019=1,\"\",IF(U215=\"\",\"\",VLOOKUP(U215,Tabelle!$B$4:$O$6,14,FALSE)))","v":""},{"$f":"IF(M$1019=1,\"\",IF(U215=\"\",\"\",VLOOKUP(U215,Tabelle!$B$4:$Q$6,16,FALSE)))","v":""},null,null,null,null,null,null,null,{"$f":"IF(B215=\"\",0,IF(B215=B214,COUNTIF(B$9:B214,B215)+1,1))","v":203},0,0]
["208","-1900","-1900-204",null,null,null,null,null,null,null,null,null,null,null,null,null,null,null,null,null,null,{"$f":"IF(M$1019=1,\"\",IF(U216=\"\",\"\",VLOOKUP(U216,Tabelle!$B$4:$O$6,14,FALSE)))","v":""},{"$f":"IF(M$1019=1,\"\",IF(U216=\"\",\"\",VLOOKUP(U216,Tabelle!$B$4:$Q$6,16,FALSE)))","v":""},null,null,null,null,null,null,null,{"$f":"IF(B216=\"\",0,IF(B216=B215,COUNTIF(B$9:B215,B216)+1,1))","v":204},0,0]
["209","-1900","-1900-205",null,null,null,null,null,null,null,null,null,null,null,null,null,null,null,null,null,null,{"$f":"IF(M$1019=1,\"\",IF(U217=\"\",\"\",VLOOKUP(U217,Tabelle!$B$4:$O$6,14,FALSE)))","v":""},{"$f":"IF(M$1019=1,\"\",IF(U217=\"\",\"\",VLOOKUP(U217,Tabelle!$B$4:$Q$6,16,FALSE)))","v":""},null,null,null,null,null,null,null,{"$f":"IF(B217=\"\",0,IF(B217=B216,COUNTIF(B$9:B216,B217)+1,1))","v":205},0,0]
["210","-1900","-1900-206",null,null,null,null,null,null,null,null,null,null,null,null,null,null,null,null,null,null,{"$f":"IF(M$1019=1,\"\",IF(U218=\"\",\"\",VLOOKUP(U218,Tabelle!$B$4:$O$6,14,FALSE)))","v":""},{"$f":"IF(M$1019=1,\"\",IF(U218=\"\",\"\",VLOOKUP(U218,Tabelle!$B$4:$Q$6,16,FALSE)))","v":""},null,null,null,null,null,null,null,{"$f":"IF(B218=\"\",0,IF(B218=B217,COUNTIF(B$9:B217,B218)+1,1))","v":206},0,0]
["211","-1900","-1900-207",null,null,null,null,null,null,null,null,null,null,null,null,null,null,null,null,null,null,{"$f":"IF(M$1019=1,\"\",IF(U219=\"\",\"\",VLOOKUP(U219,Tabelle!$B$4:$O$6,14,FALSE)))","v":""},{"$f":"IF(M$1019=1,\"\",IF(U219=\"\",\"\",VLOOKUP(U219,Tabelle!$B$4:$Q$6,16,FALSE)))","v":""},null,null,null,null,null,null,null,{"$f":"IF(B219=\"\",0,IF(B219=B218,COUNTIF(B$9:B218,B219)+1,1))","v":207},0,0]
["212","-1900","-1900-208",null,null,null,null,null,null,null,null,null,null,null,null,null,null,null,null,null,null,{"$f":"IF(M$1019=1,\"\",IF(U220=\"\",\"\",VLOOKUP(U220,Tabelle!$B$4:$O$6,14,FALSE)))","v":""},{"$f":"IF(M$1019=1,\"\",IF(U220=\"\",\"\",VLOOKUP(U220,Tabelle!$B$4:$Q$6,16,FALSE)))","v":""},null,null,null,null,null,null,null,{"$f":"IF(B220=\"\",0,IF(B220=B219,COUNTIF(B$9:B219,B220)+1,1))","v":208},0,0]
["213","-1900","-1900-209",null,null,null,null,null,null,null,null,null,null,null,null,null,null,null,null,null,null,{"$f":"IF(M$1019=1,\"\",IF(U221=\"\",\"\",VLOOKUP(U221,Tabelle!$B$4:$O$6,14,FALSE)))","v":""},{"$f":"IF(M$1019=1,\"\",IF(U221=\"\",\"\",VLOOKUP(U221,Tabelle!$B$4:$Q$6,16,FALSE)))","v":""},null,null,null,null,null,null,null,{"$f":"IF(B221=\"\",0,IF(B221=B220,COUNTIF(B$9:B220,B221)+1,1))","v":209},0,0]
["214","-1900","-1900-210",null,null,null,null,null,null,null,null,null,null,null,null,null,null,null,null,null,null,{"$f":"IF(M$1019=1,\"\",IF(U222=\"\",\"\",VLOOKUP(U222,Tabelle!$B$4:$O$6,14,FALSE)))","v":""},{"$f":"IF(M$1019=1,\"\",IF(U222=\"\",\"\",VLOOKUP(U222,Tabelle!$B$4:$Q$6,16,FALSE)))","v":""},null,null,null,null,null,null,null,{"$f":"IF(B222=\"\",0,IF(B222=B221,COUNTIF(B$9:B221,B222)+1,1))","v":210},0,0]
["215","-1900","-1900-211",null,null,null,null,null,null,null,null,null,null,null,null,null,null,null,null,null,null,{"$f":"IF(M$1019=1,\"\",IF(U223=\"\",\"\",VLOOKUP(U223,Tabelle!$B$4:$O$6,14,FALSE)))","v":""},{"$f":"IF(M$1019=1,\"\",IF(U223=\"\",\"\",VLOOKUP(U223,Tabelle!$B$4:$Q$6,16,FALSE)))","v":""},null,null,null,null,null,null,null,{"$f":"IF(B223=\"\",0,IF(B223=B222,COUNTIF(B$9:B222,B223)+1,1))","v":211},0,0]
["216","-1900","-1900-212",null,null,null,null,null,null,null,null,null,null,null,null,null,null,null,null,null,null,{"$f":"IF(M$1019=1,\"\",IF(U224=\"\",\"\",VLOOKUP(U224,Tabelle!$B$4:$O$6,14,FALSE)))","v":""},{"$f":"IF(M$1019=1,\"\",IF(U224=\"\",\"\",VLOOKUP(U224,Tabelle!$B$4:$Q$6,16,FALSE)))","v":""},null,null,null,null,null,null,null,{"$f":"IF(B224=\"\",0,IF(B224=B223,COUNTIF(B$9:B223,B224)+1,1))","v":212},0,0]
["217","-1900","-1900-213",null,null,null,null,null,null,null,null,null,null,null,null,null,null,null,null,null,null,{"$f":"IF(M$1019=1,\"\",IF(U225=\"\",\"\",VLOOKUP(U225,Tabelle!$B$4:$O$6,14,FALSE)))","v":""},{"$f":"IF(M$1019=1,\"\",IF(U225=\"\",\"\",VLOOKUP(U225,Tabelle!$B$4:$Q$6,16,FALSE)))","v":""},null,null,null,null,null,null,null,{"$f":"IF(B225=\"\",0,IF(B225=B224,COUNTIF(B$9:B224,B225)+1,1))","v":213},0,0]
["218","-1900","-1900-214",null,null,null,null,null,null,null,null,null,null,null,null,null,null,null,null,null,null,{"$f":"IF(M$1019=1,\"\",IF(U226=\"\",\"\",VLOOKUP(U226,Tabelle!$B$4:$O$6,14,FALSE)))","v":""},{"$f":"IF(M$1019=1,\"\",IF(U226=\"\",\"\",VLOOKUP(U226,Tabelle!$B$4:$Q$6,16,FALSE)))","v":""},null,null,null,null,null,null,null,{"$f":"IF(B226=\"\",0,IF(B226=B225,COUNTIF(B$9:B225,B226)+1,1))","v":214},0,0]
["219","-1900","-1900-215",null,null,null,null,null,null,null,null,null,null,null,null,null,null,null,null,null,null,{"$f":"IF(M$1019=1,\"\",IF(U227=\"\",\"\",VLOOKUP(U227,Tabelle!$B$4:$O$6,14,FALSE)))","v":""},{"$f":"IF(M$1019=1,\"\",IF(U227=\"\",\"\",VLOOKUP(U227,Tabelle!$B$4:$Q$6,16,FALSE)))","v":""},null,null,null,null,null,null,null,{"$f":"IF(B227=\"\",0,IF(B227=B226,COUNTIF(B$9:B226,B227)+1,1))","v":215},0,0]
["220","-1900","-1900-216",null,null,null,null,null,null,null,null,null,null,null,null,null,null,null,null,null,null,{"$f":"IF(M$1019=1,\"\",IF(U228=\"\",\"\",VLOOKUP(U228,Tabelle!$B$4:$O$6,14,FALSE)))","v":""},{"$f":"IF(M$1019=1,\"\",IF(U228=\"\",\"\",VLOOKUP(U228,Tabelle!$B$4:$Q$6,16,FALSE)))","v":""},null,null,null,null,null,null,null,{"$f":"IF(B228=\"\",0,IF(B228=B227,COUNTIF(B$9:B227,B228)+1,1))","v":216},0,0]
["221","-1900","-1900-217",null,null,null,null,null,null,null,null,null,null,null,null,null,null,null,null,null,null,{"$f":"IF(M$1019=1,\"\",IF(U229=\"\",\"\",VLOOKUP(U229,Tabelle!$B$4:$O$6,14,FALSE)))","v":""},{"$f":"IF(M$1019=1,\"\",IF(U229=\"\",\"\",VLOOKUP(U229,Tabelle!$B$4:$Q$6,16,FALSE)))","v":""},null,null,null,null,null,null,null,{"$f":"IF(B229=\"\",0,IF(B229=B228,COUNTIF(B$9:B228,B229)+1,1))","v":217},0,0]
["222","-1900","-1900-218",null,null,null,null,null,null,null,null,null,null,null,null,null,null,null,null,null,null,{"$f":"IF(M$1019=1,\"\",IF(U230=\"\",\"\",VLOOKUP(U230,Tabelle!$B$4:$O$6,14,FALSE)))","v":""},{"$f":"IF(M$1019=1,\"\",IF(U230=\"\",\"\",VLOOKUP(U230,Tabelle!$B$4:$Q$6,16,FALSE)))","v":""},null,null,null,null,null,null,null,{"$f":"IF(B230=\"\",0,IF(B230=B229,COUNTIF(B$9:B229,B230)+1,1))","v":218},0,0]
["223","-1900","-1900-219",null,null,null,null,null,null,null,null,null,null,null,null,null,null,null,null,null,null,{"$f":"IF(M$1019=1,\"\",IF(U231=\"\",\"\",VLOOKUP(U231,Tabelle!$B$4:$O$6,14,FALSE)))","v":""},{"$f":"IF(M$1019=1,\"\",IF(U231=\"\",\"\",VLOOKUP(U231,Tabelle!$B$4:$Q$6,16,FALSE)))","v":""},null,null,null,null,null,null,null,{"$f":"IF(B231=\"\",0,IF(B231=B230,COUNTIF(B$9:B230,B231)+1,1))","v":219},0,0]
["224","-1900","-1900-220",null,null,null,null,null,null,null,null,null,null,null,null,null,null,null,null,null,null,{"$f":"IF(M$1019=1,\"\",IF(U232=\"\",\"\",VLOOKUP(U232,Tabelle!$B$4:$O$6,14,FALSE)))","v":""},{"$f":"IF(M$1019=1,\"\",IF(U232=\"\",\"\",VLOOKUP(U232,Tabelle!$B$4:$Q$6,16,FALSE)))","v":""},null,null,null,null,null,null,null,{"$f":"IF(B232=\"\",0,IF(B232=B231,COUNTIF(B$9:B231,B232)+1,1))","v":220},0,0]
["225","-1900","-1900-221",null,null,null,null,null,null,null,null,null,null,null,null,null,null,null,null,null,null,{"$f":"IF(M$1019=1,\"\",IF(U233=\"\",\"\",VLOOKUP(U233,Tabelle!$B$4:$O$6,14,FALSE)))","v":""},{"$f":"IF(M$1019=1,\"\",IF(U233=\"\",\"\",VLOOKUP(U233,Tabelle!$B$4:$Q$6,16,FALSE)))","v":""},null,null,null,null,null,null,null,{"$f":"IF(B233=\"\",0,IF(B233=B232,COUNTIF(B$9:B232,B233)+1,1))","v":221},0,0]
["226","-1900","-1900-222",null,null,null,null,null,null,null,null,null,null,null,null,null,null,null,null,null,null,{"$f":"IF(M$1019=1,\"\",IF(U234=\"\",\"\",VLOOKUP(U234,Tabelle!$B$4:$O$6,14,FALSE)))","v":""},{"$f":"IF(M$1019=1,\"\",IF(U234=\"\",\"\",VLOOKUP(U234,Tabelle!$B$4:$Q$6,16,FALSE)))","v":""},null,null,null,null,null,null,null,{"$f":"IF(B234=\"\",0,IF(B234=B233,COUNTIF(B$9:B233,B234)+1,1))","v":222},0,0]
["227","-1900","-1900-223",null,null,null,null,null,null,null,null,null,null,null,null,null,null,null,null,null,null,{"$f":"IF(M$1019=1,\"\",IF(U235=\"\",\"\",VLOOKUP(U235,Tabelle!$B$4:$O$6,14,FALSE)))","v":""},{"$f":"IF(M$1019=1,\"\",IF(U235=\"\",\"\",VLOOKUP(U235,Tabelle!$B$4:$Q$6,16,FALSE)))","v":""},null,null,null,null,null,null,null,{"$f":"IF(B235=\"\",0,IF(B235=B234,COUNTIF(B$9:B234,B235)+1,1))","v":223},0,0]
["228","-1900","-1900-224",null,null,null,null,null,null,null,null,null,null,null,null,null,null,null,null,null,null,{"$f":"IF(M$1019=1,\"\",IF(U236=\"\",\"\",VLOOKUP(U236,Tabelle!$B$4:$O$6,14,FALSE)))","v":""},{"$f":"IF(M$1019=1,\"\",IF(U236=\"\",\"\",VLOOKUP(U236,Tabelle!$B$4:$Q$6,16,FALSE)))","v":""},null,null,null,null,null,null,null,{"$f":"IF(B236=\"\",0,IF(B236=B235,COUNTIF(B$9:B235,B236)+1,1))","v":224},0,0]
["229","-1900","-1900-225",null,null,null,null,null,null,null,null,null,null,null,null,null,null,null,null,null,null,{"$f":"IF(M$1019=1,\"\",IF(U237=\"\",\"\",VLOOKUP(U237,Tabelle!$B$4:$O$6,14,FALSE)))","v":""},{"$f":"IF(M$1019=1,\"\",IF(U237=\"\",\"\",VLOOKUP(U237,Tabelle!$B$4:$Q$6,16,FALSE)))","v":""},null,null,null,null,null,null,null,{"$f":"IF(B237=\"\",0,IF(B237=B236,COUNTIF(B$9:B236,B237)+1,1))","v":225},0,0]
["230","-1900","-1900-226",null,null,null,null,null,null,null,null,null,null,null,null,null,null,null,null,null,null,{"$f":"IF(M$1019=1,\"\",IF(U238=\"\",\"\",VLOOKUP(U238,Tabelle!$B$4:$O$6,14,FALSE)))","v":""},{"$f":"IF(M$1019=1,\"\",IF(U238=\"\",\"\",VLOOKUP(U238,Tabelle!$B$4:$Q$6,16,FALSE)))","v":""},null,null,null,null,null,null,null,{"$f":"IF(B238=\"\",0,IF(B238=B237,COUNTIF(B$9:B237,B238)+1,1))","v":226},0,0]
["231","-1900","-1900-227",null,null,null,null,null,null,null,null,null,null,null,null,null,null,null,null,null,null,{"$f":"IF(M$1019=1,\"\",IF(U239=\"\",\"\",VLOOKUP(U239,Tabelle!$B$4:$O$6,14,FALSE)))","v":""},{"$f":"IF(M$1019=1,\"\",IF(U239=\"\",\"\",VLOOKUP(U239,Tabelle!$B$4:$Q$6,16,FALSE)))","v":""},null,null,null,null,null,null,null,{"$f":"IF(B239=\"\",0,IF(B239=B238,COUNTIF(B$9:B238,B239)+1,1))","v":227},0,0]
["232","-1900","-1900-228",null,null,null,null,null,null,null,null,null,null,null,null,null,null,null,null,null,null,{"$f":"IF(M$1019=1,\"\",IF(U240=\"\",\"\",VLOOKUP(U240,Tabelle!$B$4:$O$6,14,FALSE)))","v":""},{"$f":"IF(M$1019=1,\"\",IF(U240=\"\",\"\",VLOOKUP(U240,Tabelle!$B$4:$Q$6,16,FALSE)))","v":""},null,null,null,null,null,null,null,{"$f":"IF(B240=\"\",0,IF(B240=B239,COUNTIF(B$9:B239,B240)+1,1))","v":228},0,0]
["233","-1900","-1900-229",null,null,null,null,null,null,null,null,null,null,null,null,null,null,null,null,null,null,{"$f":"IF(M$1019=1,\"\",IF(U241=\"\",\"\",VLOOKUP(U241,Tabelle!$B$4:$O$6,14,FALSE)))","v":""},{"$f":"IF(M$1019=1,\"\",IF(U241=\"\",\"\",VLOOKUP(U241,Tabelle!$B$4:$Q$6,16,FALSE)))","v":""},null,null,null,null,null,null,null,{"$f":"IF(B241=\"\",0,IF(B241=B240,COUNTIF(B$9:B240,B241)+1,1))","v":229},0,0]
["234","-1900","-1900-230",null,null,null,null,null,null,null,null,null,null,null,null,null,null,null,null,null,null,{"$f":"IF(M$1019=1,\"\",IF(U242=\"\",\"\",VLOOKUP(U242,Tabelle!$B$4:$O$6,14,FALSE)))","v":""},{"$f":"IF(M$1019=1,\"\",IF(U242=\"\",\"\",VLOOKUP(U242,Tabelle!$B$4:$Q$6,16,FALSE)))","v":""},null,null,null,null,null,null,null,{"$f":"IF(B242=\"\",0,IF(B242=B241,COUNTIF(B$9:B241,B242)+1,1))","v":230},0,0]
["235","-1900","-1900-231",null,null,null,null,null,null,null,null,null,null,null,null,null,null,null,null,null,null,{"$f":"IF(M$1019=1,\"\",IF(U243=\"\",\"\",VLOOKUP(U243,Tabelle!$B$4:$O$6,14,FALSE)))","v":""},{"$f":"IF(M$1019=1,\"\",IF(U243=\"\",\"\",VLOOKUP(U243,Tabelle!$B$4:$Q$6,16,FALSE)))","v":""},null,null,null,null,null,null,null,{"$f":"IF(B243=\"\",0,IF(B243=B242,COUNTIF(B$9:B242,B243)+1,1))","v":231},0,0]
["236","-1900","-1900-232",null,null,null,null,null,null,null,null,null,null,null,null,null,null,null,null,null,null,{"$f":"IF(M$1019=1,\"\",IF(U244=\"\",\"\",VLOOKUP(U244,Tabelle!$B$4:$O$6,14,FALSE)))","v":""},{"$f":"IF(M$1019=1,\"\",IF(U244=\"\",\"\",VLOOKUP(U244,Tabelle!$B$4:$Q$6,16,FALSE)))","v":""},null,null,null,null,null,null,null,{"$f":"IF(B244=\"\",0,IF(B244=B243,COUNTIF(B$9:B243,B244)+1,1))","v":232},0,0]
["237","-1900","-1900-233",null,null,null,null,null,null,null,null,null,null,null,null,null,null,null,null,null,null,{"$f":"IF(M$1019=1,\"\",IF(U245=\"\",\"\",VLOOKUP(U245,Tabelle!$B$4:$O$6,14,FALSE)))","v":""},{"$f":"IF(M$1019=1,\"\",IF(U245=\"\",\"\",VLOOKUP(U245,Tabelle!$B$4:$Q$6,16,FALSE)))","v":""},null,null,null,null,null,null,null,{"$f":"IF(B245=\"\",0,IF(B245=B244,COUNTIF(B$9:B244,B245)+1,1))","v":233},0,0]
["238","-1900","-1900-234",null,null,null,null,null,null,null,null,null,null,null,null,null,null,null,null,null,null,{"$f":"IF(M$1019=1,\"\",IF(U246=\"\",\"\",VLOOKUP(U246,Tabelle!$B$4:$O$6,14,FALSE)))","v":""},{"$f":"IF(M$1019=1,\"\",IF(U246=\"\",\"\",VLOOKUP(U246,Tabelle!$B$4:$Q$6,16,FALSE)))","v":""},null,null,null,null,null,null,null,{"$f":"IF(B246=\"\",0,IF(B246=B245,COUNTIF(B$9:B245,B246)+1,1))","v":234},0,0]
["239","-1900","-1900-235",null,null,null,null,null,null,null,null,null,null,null,null,null,null,null,null,null,null,{"$f":"IF(M$1019=1,\"\",IF(U247=\"\",\"\",VLOOKUP(U247,Tabelle!$B$4:$O$6,14,FALSE)))","v":""},{"$f":"IF(M$1019=1,\"\",IF(U247=\"\",\"\",VLOOKUP(U247,Tabelle!$B$4:$Q$6,16,FALSE)))","v":""},null,null,null,null,null,null,null,{"$f":"IF(B247=\"\",0,IF(B247=B246,COUNTIF(B$9:B246,B247)+1,1))","v":235},0,0]
["240","-1900","-1900-236",null,null,null,null,null,null,null,null,null,null,null,null,null,null,null,null,null,null,{"$f":"IF(M$1019=1,\"\",IF(U248=\"\",\"\",VLOOKUP(U248,Tabelle!$B$4:$O$6,14,FALSE)))","v":""},{"$f":"IF(M$1019=1,\"\",IF(U248=\"\",\"\",VLOOKUP(U248,Tabelle!$B$4:$Q$6,16,FALSE)))","v":""},null,null,null,null,null,null,null,{"$f":"IF(B248=\"\",0,IF(B248=B247,COUNTIF(B$9:B247,B248)+1,1))","v":236},0,0]
["241","-1900","-1900-237",null,null,null,null,null,null,null,null,null,null,null,null,null,null,null,null,null,null,{"$f":"IF(M$1019=1,\"\",IF(U249=\"\",\"\",VLOOKUP(U249,Tabelle!$B$4:$O$6,14,FALSE)))","v":""},{"$f":"IF(M$1019=1,\"\",IF(U249=\"\",\"\",VLOOKUP(U249,Tabelle!$B$4:$Q$6,16,FALSE)))","v":""},null,null,null,null,null,null,null,{"$f":"IF(B249=\"\",0,IF(B249=B248,COUNTIF(B$9:B248,B249)+1,1))","v":237},0,0]
["242","-1900","-1900-238",null,null,null,null,null,null,null,null,null,null,null,null,null,null,null,null,null,null,{"$f":"IF(M$1019=1,\"\",IF(U250=\"\",\"\",VLOOKUP(U250,Tabelle!$B$4:$O$6,14,FALSE)))","v":""},{"$f":"IF(M$1019=1,\"\",IF(U250=\"\",\"\",VLOOKUP(U250,Tabelle!$B$4:$Q$6,16,FALSE)))","v":""},null,null,null,null,null,null,null,{"$f":"IF(B250=\"\",0,IF(B250=B249,COUNTIF(B$9:B249,B250)+1,1))","v":238},0,0]
["243","-1900","-1900-239",null,null,null,null,null,null,null,null,null,null,null,null,null,null,null,null,null,null,{"$f":"IF(M$1019=1,\"\",IF(U251=\"\",\"\",VLOOKUP(U251,Tabelle!$B$4:$O$6,14,FALSE)))","v":""},{"$f":"IF(M$1019=1,\"\",IF(U251=\"\",\"\",VLOOKUP(U251,Tabelle!$B$4:$Q$6,16,FALSE)))","v":""},null,null,null,null,null,null,null,{"$f":"IF(B251=\"\",0,IF(B251=B250,COUNTIF(B$9:B250,B251)+1,1))","v":239},0,0]
["244","-1900","-1900-240",null,null,null,null,null,null,null,null,null,null,null,null,null,null,null,null,null,null,{"$f":"IF(M$1019=1,\"\",IF(U252=\"\",\"\",VLOOKUP(U252,Tabelle!$B$4:$O$6,14,FALSE)))","v":""},{"$f":"IF(M$1019=1,\"\",IF(U252=\"\",\"\",VLOOKUP(U252,Tabelle!$B$4:$Q$6,16,FALSE)))","v":""},null,null,null,null,null,null,null,{"$f":"IF(B252=\"\",0,IF(B252=B251,COUNTIF(B$9:B251,B252)+1,1))","v":240},0,0]
["245","-1900","-1900-241",null,null,null,null,null,null,null,null,null,null,null,null,null,null,null,null,null,null,{"$f":"IF(M$1019=1,\"\",IF(U253=\"\",\"\",VLOOKUP(U253,Tabelle!$B$4:$O$6,14,FALSE)))","v":""},{"$f":"IF(M$1019=1,\"\",IF(U253=\"\",\"\",VLOOKUP(U253,Tabelle!$B$4:$Q$6,16,FALSE)))","v":""},null,null,null,null,null,null,null,{"$f":"IF(B253=\"\",0,IF(B253=B252,COUNTIF(B$9:B252,B253)+1,1))","v":241},0,0]
["246","-1900","-1900-242",null,null,null,null,null,null,null,null,null,null,null,null,null,null,null,null,null,null,{"$f":"IF(M$1019=1,\"\",IF(U254=\"\",\"\",VLOOKUP(U254,Tabelle!$B$4:$O$6,14,FALSE)))","v":""},{"$f":"IF(M$1019=1,\"\",IF(U254=\"\",\"\",VLOOKUP(U254,Tabelle!$B$4:$Q$6,16,FALSE)))","v":""},null,null,null,null,null,null,null,{"$f":"IF(B254=\"\",0,IF(B254=B253,COUNTIF(B$9:B253,B254)+1,1))","v":242},0,0]
["247","-1900","-1900-243",null,null,null,null,null,null,null,null,null,null,null,null,null,null,null,null,null,null,{"$f":"IF(M$1019=1,\"\",IF(U255=\"\",\"\",VLOOKUP(U255,Tabelle!$B$4:$O$6,14,FALSE)))","v":""},{"$f":"IF(M$1019=1,\"\",IF(U255=\"\",\"\",VLOOKUP(U255,Tabelle!$B$4:$Q$6,16,FALSE)))","v":""},null,null,null,null,null,null,null,{"$f":"IF(B255=\"\",0,IF(B255=B254,COUNTIF(B$9:B254,B255)+1,1))","v":243},0,0]
["248","-1900","-1900-244",null,null,null,null,null,null,null,null,null,null,null,null,null,null,null,null,null,null,{"$f":"IF(M$1019=1,\"\",IF(U256=\"\",\"\",VLOOKUP(U256,Tabelle!$B$4:$O$6,14,FALSE)))","v":""},{"$f":"IF(M$1019=1,\"\",IF(U256=\"\",\"\",VLOOKUP(U256,Tabelle!$B$4:$Q$6,16,FALSE)))","v":""},null,null,null,null,null,null,null,{"$f":"IF(B256=\"\",0,IF(B256=B255,COUNTIF(B$9:B255,B256)+1,1))","v":244},0,0]
["249","-1900","-1900-245",null,null,null,null,null,null,null,null,null,null,null,null,null,null,null,null,null,null,{"$f":"IF(M$1019=1,\"\",IF(U257=\"\",\"\",VLOOKUP(U257,Tabelle!$B$4:$O$6,14,FALSE)))","v":""},{"$f":"IF(M$1019=1,\"\",IF(U257=\"\",\"\",VLOOKUP(U257,Tabelle!$B$4:$Q$6,16,FALSE)))","v":""},null,null,null,null,null,null,null,{"$f":"IF(B257=\"\",0,IF(B257=B256,COUNTIF(B$9:B256,B257)+1,1))","v":245},0,0]
["250","-1900","-1900-246",null,null,null,null,null,null,null,null,null,null,null,null,null,null,null,null,null,null,{"$f":"IF(M$1019=1,\"\",IF(U258=\"\",\"\",VLOOKUP(U258,Tabelle!$B$4:$O$6,14,FALSE)))","v":""},{"$f":"IF(M$1019=1,\"\",IF(U258=\"\",\"\",VLOOKUP(U258,Tabelle!$B$4:$Q$6,16,FALSE)))","v":""},null,null,null,null,null,null,null,{"$f":"IF(B258=\"\",0,IF(B258=B257,COUNTIF(B$9:B257,B258)+1,1))","v":246},0,0]
["251","-1900","-1900-247",null,null,null,null,null,null,null,null,null,null,null,null,null,null,null,null,null,null,{"$f":"IF(M$1019=1,\"\",IF(U259=\"\",\"\",VLOOKUP(U259,Tabelle!$B$4:$O$6,14,FALSE)))","v":""},{"$f":"IF(M$1019=1,\"\",IF(U259=\"\",\"\",VLOOKUP(U259,Tabelle!$B$4:$Q$6,16,FALSE)))","v":""},null,null,null,null,null,null,null,{"$f":"IF(B259=\"\",0,IF(B259=B258,COUNTIF(B$9:B258,B259)+1,1))","v":247},0,0]
["252","-1900","-1900-248",null,null,null,null,null,null,null,null,null,null,null,null,null,null,null,null,null,null,{"$f":"IF(M$1019=1,\"\",IF(U260=\"\",\"\",VLOOKUP(U260,Tabelle!$B$4:$O$6,14,FALSE)))","v":""},{"$f":"IF(M$1019=1,\"\",IF(U260=\"\",\"\",VLOOKUP(U260,Tabelle!$B$4:$Q$6,16,FALSE)))","v":""},null,null,null,null,null,null,null,{"$f":"IF(B260=\"\",0,IF(B260=B259,COUNTIF(B$9:B259,B260)+1,1))","v":248},0,0]
["253","-1900","-1900-249",null,null,null,null,null,null,null,null,null,null,null,null,null,null,null,null,null,null,{"$f":"IF(M$1019=1,\"\",IF(U261=\"\",\"\",VLOOKUP(U261,Tabelle!$B$4:$O$6,14,FALSE)))","v":""},{"$f":"IF(M$1019=1,\"\",IF(U261=\"\",\"\",VLOOKUP(U261,Tabelle!$B$4:$Q$6,16,FALSE)))","v":""},null,null,null,null,null,null,null,{"$f":"IF(B261=\"\",0,IF(B261=B260,COUNTIF(B$9:B260,B261)+1,1))","v":249},0,0]
["254","-1900","-1900-250",null,null,null,null,null,null,null,null,null,null,null,null,null,null,null,null,null,null,{"$f":"IF(M$1019=1,\"\",IF(U262=\"\",\"\",VLOOKUP(U262,Tabelle!$B$4:$O$6,14,FALSE)))","v":""},{"$f":"IF(M$1019=1,\"\",IF(U262=\"\",\"\",VLOOKUP(U262,Tabelle!$B$4:$Q$6,16,FALSE)))","v":""},null,null,null,null,null,null,null,{"$f":"IF(B262=\"\",0,IF(B262=B261,COUNTIF(B$9:B261,B262)+1,1))","v":250},0,0]
["255","-1900","-1900-251",null,null,null,null,null,null,null,null,null,null,null,null,null,null,null,null,null,null,{"$f":"IF(M$1019=1,\"\",IF(U263=\"\",\"\",VLOOKUP(U263,Tabelle!$B$4:$O$6,14,FALSE)))","v":""},{"$f":"IF(M$1019=1,\"\",IF(U263=\"\",\"\",VLOOKUP(U263,Tabelle!$B$4:$Q$6,16,FALSE)))","v":""},null,null,null,null,null,null,null,{"$f":"IF(B263=\"\",0,IF(B263=B262,COUNTIF(B$9:B262,B263)+1,1))","v":251},0,0]
["256","-1900","-1900-252",null,null,null,null,null,null,null,null,null,null,null,null,null,null,null,null,null,null,{"$f":"IF(M$1019=1,\"\",IF(U264=\"\",\"\",VLOOKUP(U264,Tabelle!$B$4:$O$6,14,FALSE)))","v":""},{"$f":"IF(M$1019=1,\"\",IF(U264=\"\",\"\",VLOOKUP(U264,Tabelle!$B$4:$Q$6,16,FALSE)))","v":""},null,null,null,null,null,null,null,{"$f":"IF(B264=\"\",0,IF(B264=B263,COUNTIF(B$9:B263,B264)+1,1))","v":252},0,0]
["257","-1900",{"$f":"IF(M$1019=1,0,B265&\"-\"&AE265)","v":"-1900-253"},null,null,null,null,null,null,null,null,null,null,null,null,null,null,null,null,null,null,{"$f":"IF(M$1019=1,\"\",IF(U265=\"\",\"\",VLOOKUP(U265,Tabelle!$B$4:$O$6,14,FALSE)))","v":""},{"$f":"IF(M$1019=1,\"\",IF(U265=\"\",\"\",VLOOKUP(U265,Tabelle!$B$4:$Q$6,16,FALSE)))","v":""},null,null,null,null,null,null,null,{"$f":"IF(B265=\"\",0,IF(B265=B264,COUNTIF(B$9:B264,B265)+1,1))","v":253},0,0]
["258",{"$f":"IF(AG266=$AG$1013,0,IF(M$1019=1,0,D266&\"-\"&YEAR(E266)))","v":"-1900"},"-1900-254",null,null,null,null,null,null,null,null,null,null,null,null,null,null,null,null,null,null,{"$f":"IF(M$1019=1,\"\",IF(U266=\"\",\"\",VLOOKUP(U266,Tabelle!$B$4:$O$6,14,FALSE)))","v":""},{"$f":"IF(M$1019=1,\"\",IF(U266=\"\",\"\",VLOOKUP(U266,Tabelle!$B$4:$Q$6,16,FALSE)))","v":""},null,null,null,null,null,null,null,{"$f":"IF(B266=\"\",0,IF(B266=B265,COUNTIF(B$9:B265,B266)+1,1))","v":254},0,{"$f":"IF(E266>0,IF(OR(MONTH(E266)<$L$1030,MONTH(E266)>$L$1031),AG$1013,0),0)","v":0}]
["259","-1900","-1900-255",null,null,null,null,null,null,null,null,null,null,null,null,null,null,null,null,null,null,{"$f":"IF(M$1019=1,\"\",IF(U267=\"\",\"\",VLOOKUP(U267,Tabelle!$B$4:$O$6,14,FALSE)))","v":""},{"$f":"IF(M$1019=1,\"\",IF(U267=\"\",\"\",VLOOKUP(U267,Tabelle!$B$4:$Q$6,16,FALSE)))","v":""},null,null,null,null,null,null,null,{"$f":"IF(B267=\"\",0,IF(B267=B266,COUNTIF(B$9:B266,B267)+1,1))","v":255},0,0]
["260","-1900","-1900-256",null,null,null,null,null,null,null,null,null,null,null,null,null,null,null,null,null,null,{"$f":"IF(M$1019=1,\"\",IF(U268=\"\",\"\",VLOOKUP(U268,Tabelle!$B$4:$O$6,14,FALSE)))","v":""},{"$f":"IF(M$1019=1,\"\",IF(U268=\"\",\"\",VLOOKUP(U268,Tabelle!$B$4:$Q$6,16,FALSE)))","v":""},null,null,null,null,null,null,null,{"$f":"IF(B268=\"\",0,IF(B268=B267,COUNTIF(B$9:B267,B268)+1,1))","v":256},0,0]
["261","-1900","-1900-257",null,null,null,null,null,null,null,null,null,null,null,null,null,null,null,null,null,null,{"$f":"IF(M$1019=1,\"\",IF(U269=\"\",\"\",VLOOKUP(U269,Tabelle!$B$4:$O$6,14,FALSE)))","v":""},{"$f":"IF(M$1019=1,\"\",IF(U269=\"\",\"\",VLOOKUP(U269,Tabelle!$B$4:$Q$6,16,FALSE)))","v":""},null,null,null,null,null,null,null,{"$f":"IF(B269=\"\",0,IF(B269=B268,COUNTIF(B$9:B268,B269)+1,1))","v":257},0,0]
["262","-1900","-1900-258",null,null,null,null,null,null,null,null,null,null,null,null,null,null,null,null,null,null,{"$f":"IF(M$1019=1,\"\",IF(U270=\"\",\"\",VLOOKUP(U270,Tabelle!$B$4:$O$6,14,FALSE)))","v":""},{"$f":"IF(M$1019=1,\"\",IF(U270=\"\",\"\",VLOOKUP(U270,Tabelle!$B$4:$Q$6,16,FALSE)))","v":""},null,null,null,null,null,null,null,{"$f":"IF(B270=\"\",0,IF(B270=B269,COUNTIF(B$9:B269,B270)+1,1))","v":258},0,0]
["263","-1900","-1900-259",null,null,null,null,null,null,null,null,null,null,null,null,null,null,null,null,null,null,{"$f":"IF(M$1019=1,\"\",IF(U271=\"\",\"\",VLOOKUP(U271,Tabelle!$B$4:$O$6,14,FALSE)))","v":""},{"$f":"IF(M$1019=1,\"\",IF(U271=\"\",\"\",VLOOKUP(U271,Tabelle!$B$4:$Q$6,16,FALSE)))","v":""},null,null,null,null,null,null,null,{"$f":"IF(B271=\"\",0,IF(B271=B270,COUNTIF(B$9:B270,B271)+1,1))","v":259},0,0]
["264","-1900","-1900-260",null,null,null,null,null,null,null,null,null,null,null,null,null,null,null,null,null,null,{"$f":"IF(M$1019=1,\"\",IF(U272=\"\",\"\",VLOOKUP(U272,Tabelle!$B$4:$O$6,14,FALSE)))","v":""},{"$f":"IF(M$1019=1,\"\",IF(U272=\"\",\"\",VLOOKUP(U272,Tabelle!$B$4:$Q$6,16,FALSE)))","v":""},null,null,null,null,null,null,null,{"$f":"IF(B272=\"\",0,IF(B272=B271,COUNTIF(B$9:B271,B272)+1,1))","v":260},0,0]
["265","-1900","-1900-261",null,null,null,null,null,null,null,null,null,null,null,null,null,null,null,null,null,null,{"$f":"IF(M$1019=1,\"\",IF(U273=\"\",\"\",VLOOKUP(U273,Tabelle!$B$4:$O$6,14,FALSE)))","v":""},{"$f":"IF(M$1019=1,\"\",IF(U273=\"\",\"\",VLOOKUP(U273,Tabelle!$B$4:$Q$6,16,FALSE)))","v":""},null,null,null,null,null,null,null,{"$f":"IF(B273=\"\",0,IF(B273=B272,COUNTIF(B$9:B272,B273)+1,1))","v":261},0,0]
["266","-1900","-1900-262",null,null,null,null,null,null,null,null,null,null,null,null,null,null,null,null,null,null,{"$f":"IF(M$1019=1,\"\",IF(U274=\"\",\"\",VLOOKUP(U274,Tabelle!$B$4:$O$6,14,FALSE)))","v":""},{"$f":"IF(M$1019=1,\"\",IF(U274=\"\",\"\",VLOOKUP(U274,Tabelle!$B$4:$Q$6,16,FALSE)))","v":""},null,null,null,null,null,null,null,{"$f":"IF(B274=\"\",0,IF(B274=B273,COUNTIF(B$9:B273,B274)+1,1))","v":262},0,0]
["267","-1900","-1900-263",null,null,null,null,null,null,null,null,null,null,null,null,null,null,null,null,null,null,{"$f":"IF(M$1019=1,\"\",IF(U275=\"\",\"\",VLOOKUP(U275,Tabelle!$B$4:$O$6,14,FALSE)))","v":""},{"$f":"IF(M$1019=1,\"\",IF(U275=\"\",\"\",VLOOKUP(U275,Tabelle!$B$4:$Q$6,16,FALSE)))","v":""},null,null,null,null,null,null,null,{"$f":"IF(B275=\"\",0,IF(B275=B274,COUNTIF(B$9:B274,B275)+1,1))","v":263},0,0]
["268","-1900","-1900-264",null,null,null,null,null,null,null,null,null,null,null,null,null,null,null,null,null,null,{"$f":"IF(M$1019=1,\"\",IF(U276=\"\",\"\",VLOOKUP(U276,Tabelle!$B$4:$O$6,14,FALSE)))","v":""},{"$f":"IF(M$1019=1,\"\",IF(U276=\"\",\"\",VLOOKUP(U276,Tabelle!$B$4:$Q$6,16,FALSE)))","v":""},null,null,null,null,null,null,null,{"$f":"IF(B276=\"\",0,IF(B276=B275,COUNTIF(B$9:B275,B276)+1,1))","v":264},{"$f":"IF(OR(D276=\"\",M$1019=1),0,IF(AE276=8,1,0))","v":0},0]
["269","-1900","-1900-265",null,null,null,null,null,null,null,null,null,null,null,null,null,null,null,null,null,null,{"$f":"IF(M$1019=1,\"\",IF(U277=\"\",\"\",VLOOKUP(U277,Tabelle!$B$4:$O$6,14,FALSE)))","v":""},{"$f":"IF(M$1019=1,\"\",IF(U277=\"\",\"\",VLOOKUP(U277,Tabelle!$B$4:$Q$6,16,FALSE)))","v":""},null,null,null,null,null,null,null,{"$f":"IF(B277=\"\",0,IF(B277=B276,COUNTIF(B$9:B276,B277)+1,1))","v":265},0,0]
["270","-1900","-1900-266",null,null,null,null,null,null,null,null,null,null,null,null,null,null,null,null,null,null,{"$f":"IF(M$1019=1,\"\",IF(U278=\"\",\"\",VLOOKUP(U278,Tabelle!$B$4:$O$6,14,FALSE)))","v":""},{"$f":"IF(M$1019=1,\"\",IF(U278=\"\",\"\",VLOOKUP(U278,Tabelle!$B$4:$Q$6,16,FALSE)))","v":""},null,null,null,null,null,null,null,{"$f":"IF(B278=\"\",0,IF(B278=B277,COUNTIF(B$9:B277,B278)+1,1))","v":266},0,0]
["271","-1900","-1900-267",null,null,null,null,null,null,null,null,null,null,null,null,null,null,null,null,null,null,{"$f":"IF(M$1019=1,\"\",IF(U279=\"\",\"\",VLOOKUP(U279,Tabelle!$B$4:$O$6,14,FALSE)))","v":""},{"$f":"IF(M$1019=1,\"\",IF(U279=\"\",\"\",VLOOKUP(U279,Tabelle!$B$4:$Q$6,16,FALSE)))","v":""},null,null,null,null,null,null,null,{"$f":"IF(B279=\"\",0,IF(B279=B278,COUNTIF(B$9:B278,B279)+1,1))","v":267},0,0]
["272","-1900","-1900-268",null,null,null,null,null,null,null,null,null,null,null,null,null,null,null,null,null,null,{"$f":"IF(M$1019=1,\"\",IF(U280=\"\",\"\",VLOOKUP(U280,Tabelle!$B$4:$O$6,14,FALSE)))","v":""},{"$f":"IF(M$1019=1,\"\",IF(U280=\"\",\"\",VLOOKUP(U280,Tabelle!$B$4:$Q$6,16,FALSE)))","v":""},null,null,null,null,null,null,null,{"$f":"IF(B280=\"\",0,IF(B280=B279,COUNTIF(B$9:B279,B280)+1,1))","v":268},0,0]
["273","-1900","-1900-269",null,null,null,null,null,null,null,null,null,null,null,null,null,null,null,null,null,null,{"$f":"IF(M$1019=1,\"\",IF(U281=\"\",\"\",VLOOKUP(U281,Tabelle!$B$4:$O$6,14,FALSE)))","v":""},{"$f":"IF(M$1019=1,\"\",IF(U281=\"\",\"\",VLOOKUP(U281,Tabelle!$B$4:$Q$6,16,FALSE)))","v":""},null,null,null,null,null,null,null,{"$f":"IF(B281=\"\",0,IF(B281=B280,COUNTIF(B$9:B280,B281)+1,1))","v":269},0,0]
["274","-1900","-1900-270",null,null,null,null,null,null,null,null,null,null,null,null,null,null,null,null,null,null,{"$f":"IF(M$1019=1,\"\",IF(U282=\"\",\"\",VLOOKUP(U282,Tabelle!$B$4:$O$6,14,FALSE)))","v":""},{"$f":"IF(M$1019=1,\"\",IF(U282=\"\",\"\",VLOOKUP(U282,Tabelle!$B$4:$Q$6,16,FALSE)))","v":""},null,null,null,null,null,null,null,{"$f":"IF(B282=\"\",0,IF(B282=B281,COUNTIF(B$9:B281,B282)+1,1))","v":270},0,0]
["275","-1900","-1900-271",null,null,null,null,null,null,null,null,null,null,null,null,null,null,null,null,null,null,{"$f":"IF(M$1019=1,\"\",IF(U283=\"\",\"\",VLOOKUP(U283,Tabelle!$B$4:$O$6,14,FALSE)))","v":""},{"$f":"IF(M$1019=1,\"\",IF(U283=\"\",\"\",VLOOKUP(U283,Tabelle!$B$4:$Q$6,16,FALSE)))","v":""},null,null,null,null,null,null,null,{"$f":"IF(B283=\"\",0,IF(B283=B282,COUNTIF(B$9:B282,B283)+1,1))","v":271},0,0]
["276","-1900","-1900-272",null,null,null,null,null,null,null,null,null,null,null,null,null,null,null,null,null,null,{"$f":"IF(M$1019=1,\"\",IF(U284=\"\",\"\",VLOOKUP(U284,Tabelle!$B$4:$O$6,14,FALSE)))","v":""},{"$f":"IF(M$1019=1,\"\",IF(U284=\"\",\"\",VLOOKUP(U284,Tabelle!$B$4:$Q$6,16,FALSE)))","v":""},null,null,null,null,null,null,null,{"$f":"IF(B284=\"\",0,IF(B284=B283,COUNTIF(B$9:B283,B284)+1,1))","v":272},0,0]
["277","-1900","-1900-273",null,null,null,null,null,null,null,null,null,null,null,null,null,null,null,null,null,null,{"$f":"IF(M$1019=1,\"\",IF(U285=\"\",\"\",VLOOKUP(U285,Tabelle!$B$4:$O$6,14,FALSE)))","v":""},{"$f":"IF(M$1019=1,\"\",IF(U285=\"\",\"\",VLOOKUP(U285,Tabelle!$B$4:$Q$6,16,FALSE)))","v":""},null,null,null,null,null,null,null,{"$f":"IF(B285=\"\",0,IF(B285=B284,COUNTIF(B$9:B284,B285)+1,1))","v":273},0,0]
["278","-1900","-1900-274",null,null,null,null,null,null,null,null,null,null,null,null,null,null,null,null,null,null,{"$f":"IF(M$1019=1,\"\",IF(U286=\"\",\"\",VLOOKUP(U286,Tabelle!$B$4:$O$6,14,FALSE)))","v":""},{"$f":"IF(M$1019=1,\"\",IF(U286=\"\",\"\",VLOOKUP(U286,Tabelle!$B$4:$Q$6,16,FALSE)))","v":""},null,null,null,null,null,null,null,{"$f":"IF(B286=\"\",0,IF(B286=B285,COUNTIF(B$9:B285,B286)+1,1))","v":274},0,0]
["279","-1900","-1900-275",null,null,null,null,null,null,null,null,null,null,null,null,null,null,null,null,null,null,{"$f":"IF(M$1019=1,\"\",IF(U287=\"\",\"\",VLOOKUP(U287,Tabelle!$B$4:$O$6,14,FALSE)))","v":""},{"$f":"IF(M$1019=1,\"\",IF(U287=\"\",\"\",VLOOKUP(U287,Tabelle!$B$4:$Q$6,16,FALSE)))","v":""},null,null,null,null,null,null,null,{"$f":"IF(B287=\"\",0,IF(B287=B286,COUNTIF(B$9:B286,B287)+1,1))","v":275},0,0]
["280","-1900","-1900-276",null,null,null,null,null,null,null,null,null,null,null,null,null,null,null,null,null,null,{"$f":"IF(M$1019=1,\"\",IF(U288=\"\",\"\",VLOOKUP(U288,Tabelle!$B$4:$O$6,14,FALSE)))","v":""},{"$f":"IF(M$1019=1,\"\",IF(U288=\"\",\"\",VLOOKUP(U288,Tabelle!$B$4:$Q$6,16,FALSE)))","v":""},null,null,null,null,null,null,null,{"$f":"IF(B288=\"\",0,IF(B288=B287,COUNTIF(B$9:B287,B288)+1,1))","v":276},0,0]
["281","-1900","-1900-277",null,null,null,null,null,null,null,null,null,null,null,null,null,null,null,null,null,null,{"$f":"IF(M$1019=1,\"\",IF(U289=\"\",\"\",VLOOKUP(U289,Tabelle!$B$4:$O$6,14,FALSE)))","v":""},{"$f":"IF(M$1019=1,\"\",IF(U289=\"\",\"\",VLOOKUP(U289,Tabelle!$B$4:$Q$6,16,FALSE)))","v":""},null,null,null,null,null,null,null,{"$f":"IF(B289=\"\",0,IF(B289=B288,COUNTIF(B$9:B288,B289)+1,1))","v":277},0,0]
["282","-1900","-1900-278",null,null,null,null,null,null,null,null,null,null,null,null,null,null,null,null,null,null,{"$f":"IF(M$1019=1,\"\",IF(U290=\"\",\"\",VLOOKUP(U290,Tabelle!$B$4:$O$6,14,FALSE)))","v":""},{"$f":"IF(M$1019=1,\"\",IF(U290=\"\",\"\",VLOOKUP(U290,Tabelle!$B$4:$Q$6,16,FALSE)))","v":""},null,null,null,null,null,null,null,{"$f":"IF(B290=\"\",0,IF(B290=B289,COUNTIF(B$9:B289,B290)+1,1))","v":278},0,0]
["283","-1900","-1900-279",null,null,null,null,null,null,null,null,null,null,null,null,null,null,null,null,null,null,{"$f":"IF(M$1019=1,\"\",IF(U291=\"\",\"\",VLOOKUP(U291,Tabelle!$B$4:$O$6,14,FALSE)))","v":""},{"$f":"IF(M$1019=1,\"\",IF(U291=\"\",\"\",VLOOKUP(U291,Tabelle!$B$4:$Q$6,16,FALSE)))","v":""},null,null,null,null,null,null,null,{"$f":"IF(B291=\"\",0,IF(B291=B290,COUNTIF(B$9:B290,B291)+1,1))","v":279},0,0]
["284","-1900","-1900-280",null,null,null,null,null,null,null,null,null,null,null,null,null,null,null,null,null,null,{"$f":"IF(M$1019=1,\"\",IF(U292=\"\",\"\",VLOOKUP(U292,Tabelle!$B$4:$O$6,14,FALSE)))","v":""},{"$f":"IF(M$1019=1,\"\",IF(U292=\"\",\"\",VLOOKUP(U292,Tabelle!$B$4:$Q$6,16,FALSE)))","v":""},null,null,null,null,null,null,null,{"$f":"IF(B292=\"\",0,IF(B292=B291,COUNTIF(B$9:B291,B292)+1,1))","v":280},0,0]
["285","-1900","-1900-281",null,null,null,null,null,null,null,null,null,null,null,null,null,null,null,null,null,null,{"$f":"IF(M$1019=1,\"\",IF(U293=\"\",\"\",VLOOKUP(U293,Tabelle!$B$4:$O$6,14,FALSE)))","v":""},{"$f":"IF(M$1019=1,\"\",IF(U293=\"\",\"\",VLOOKUP(U293,Tabelle!$B$4:$Q$6,16,FALSE)))","v":""},null,null,null,null,null,null,null,{"$f":"IF(B293=\"\",0,IF(B293=B292,COUNTIF(B$9:B292,B293)+1,1))","v":281},0,0]
["286","-1900","-1900-282",null,null,null,null,null,null,null,null,null,null,null,null,null,null,null,null,null,null,{"$f":"IF(M$1019=1,\"\",IF(U294=\"\",\"\",VLOOKUP(U294,Tabelle!$B$4:$O$6,14,FALSE)))","v":""},{"$f":"IF(M$1019=1,\"\",IF(U294=\"\",\"\",VLOOKUP(U294,Tabelle!$B$4:$Q$6,16,FALSE)))","v":""},null,null,null,null,null,null,null,{"$f":"IF(B294=\"\",0,IF(B294=B293,COUNTIF(B$9:B293,B294)+1,1))","v":282},0,0]
["287","-1900","-1900-283",null,null,null,null,null,null,null,null,null,null,null,null,null,null,null,null,null,null,{"$f":"IF(M$1019=1,\"\",IF(U295=\"\",\"\",VLOOKUP(U295,Tabelle!$B$4:$O$6,14,FALSE)))","v":""},{"$f":"IF(M$1019=1,\"\",IF(U295=\"\",\"\",VLOOKUP(U295,Tabelle!$B$4:$Q$6,16,FALSE)))","v":""},null,null,null,null,null,null,null,{"$f":"IF(B295=\"\",0,IF(B295=B294,COUNTIF(B$9:B294,B295)+1,1))","v":283},0,0]
["288","-1900","-1900-284",null,null,null,null,null,null,null,null,null,null,null,null,null,null,null,null,null,null,{"$f":"IF(M$1019=1,\"\",IF(U296=\"\",\"\",VLOOKUP(U296,Tabelle!$B$4:$O$6,14,FALSE)))","v":""},{"$f":"IF(M$1019=1,\"\",IF(U296=\"\",\"\",VLOOKUP(U296,Tabelle!$B$4:$Q$6,16,FALSE)))","v":""},null,null,null,null,null,null,null,{"$f":"IF(B296=\"\",0,IF(B296=B295,COUNTIF(B$9:B295,B296)+1,1))","v":284},0,0]
["289","-1900","-1900-285",null,null,null,null,null,null,null,null,null,null,null,null,null,null,null,null,null,null,{"$f":"IF(M$1019=1,\"\",IF(U297=\"\",\"\",VLOOKUP(U297,Tabelle!$B$4:$O$6,14,FALSE)))","v":""},{"$f":"IF(M$1019=1,\"\",IF(U297=\"\",\"\",VLOOKUP(U297,Tabelle!$B$4:$Q$6,16,FALSE)))","v":""},null,null,null,null,null,null,null,{"$f":"IF(B297=\"\",0,IF(B297=B296,COUNTIF(B$9:B296,B297)+1,1))","v":285},0,0]
["290","-1900","-1900-286",null,null,null,null,null,null,null,null,null,null,null,null,null,null,null,null,null,null,{"$f":"IF(M$1019=1,\"\",IF(U298=\"\",\"\",VLOOKUP(U298,Tabelle!$B$4:$O$6,14,FALSE)))","v":""},{"$f":"IF(M$1019=1,\"\",IF(U298=\"\",\"\",VLOOKUP(U298,Tabelle!$B$4:$Q$6,16,FALSE)))","v":""},null,null,null,null,null,null,null,{"$f":"IF(B298=\"\",0,IF(B298=B297,COUNTIF(B$9:B297,B298)+1,1))","v":286},0,0]
["291","-1900","-1900-287",null,null,null,null,null,null,null,null,null,null,null,null,null,null,null,null,null,null,{"$f":"IF(M$1019=1,\"\",IF(U299=\"\",\"\",VLOOKUP(U299,Tabelle!$B$4:$O$6,14,FALSE)))","v":""},{"$f":"IF(M$1019=1,\"\",IF(U299=\"\",\"\",VLOOKUP(U299,Tabelle!$B$4:$Q$6,16,FALSE)))","v":""},null,null,null,null,null,null,null,{"$f":"IF(B299=\"\",0,IF(B299=B298,COUNTIF(B$9:B298,B299)+1,1))","v":287},0,0]
["292","-1900","-1900-288",null,null,null,null,null,null,null,null,null,null,null,null,null,null,null,null,null,null,{"$f":"IF(M$1019=1,\"\",IF(U300=\"\",\"\",VLOOKUP(U300,Tabelle!$B$4:$O$6,14,FALSE)))","v":""},{"$f":"IF(M$1019=1,\"\",IF(U300=\"\",\"\",VLOOKUP(U300,Tabelle!$B$4:$Q$6,16,FALSE)))","v":""},null,null,null,null,null,null,null,{"$f":"IF(B300=\"\",0,IF(B300=B299,COUNTIF(B$9:B299,B300)+1,1))","v":288},0,0]
["293","-1900","-1900-289",null,null,null,null,null,null,null,null,null,null,null,null,null,null,null,null,null,null,{"$f":"IF(M$1019=1,\"\",IF(U301=\"\",\"\",VLOOKUP(U301,Tabelle!$B$4:$O$6,14,FALSE)))","v":""},{"$f":"IF(M$1019=1,\"\",IF(U301=\"\",\"\",VLOOKUP(U301,Tabelle!$B$4:$Q$6,16,FALSE)))","v":""},null,null,null,null,null,null,null,{"$f":"IF(B301=\"\",0,IF(B301=B300,COUNTIF(B$9:B300,B301)+1,1))","v":289},0,0]
["294","-1900","-1900-290",null,null,null,null,null,null,null,null,null,null,null,null,null,null,null,null,null,null,{"$f":"IF(M$1019=1,\"\",IF(U302=\"\",\"\",VLOOKUP(U302,Tabelle!$B$4:$O$6,14,FALSE)))","v":""},{"$f":"IF(M$1019=1,\"\",IF(U302=\"\",\"\",VLOOKUP(U302,Tabelle!$B$4:$Q$6,16,FALSE)))","v":""},null,null,null,null,null,null,null,{"$f":"IF(B302=\"\",0,IF(B302=B301,COUNTIF(B$9:B301,B302)+1,1))","v":290},0,0]
["295","-1900","-1900-291",null,null,null,null,null,null,null,null,null,null,null,null,null,null,null,null,null,null,{"$f":"IF(M$1019=1,\"\",IF(U303=\"\",\"\",VLOOKUP(U303,Tabelle!$B$4:$O$6,14,FALSE)))","v":""},{"$f":"IF(M$1019=1,\"\",IF(U303=\"\",\"\",VLOOKUP(U303,Tabelle!$B$4:$Q$6,16,FALSE)))","v":""},null,null,null,null,null,null,null,{"$f":"IF(B303=\"\",0,IF(B303=B302,COUNTIF(B$9:B302,B303)+1,1))","v":291},0,0]
["296","-1900","-1900-292",null,null,null,null,null,null,null,null,null,null,null,null,null,null,null,null,null,null,{"$f":"IF(M$1019=1,\"\",IF(U304=\"\",\"\",VLOOKUP(U304,Tabelle!$B$4:$O$6,14,FALSE)))","v":""},{"$f":"IF(M$1019=1,\"\",IF(U304=\"\",\"\",VLOOKUP(U304,Tabelle!$B$4:$Q$6,16,FALSE)))","v":""},null,null,null,null,null,null,null,{"$f":"IF(B304=\"\",0,IF(B304=B303,COUNTIF(B$9:B303,B304)+1,1))","v":292},0,0]
["297","-1900","-1900-293",null,null,null,null,null,null,null,null,null,null,null,null,null,null,null,null,null,null,{"$f":"IF(M$1019=1,\"\",IF(U305=\"\",\"\",VLOOKUP(U305,Tabelle!$B$4:$O$6,14,FALSE)))","v":""},{"$f":"IF(M$1019=1,\"\",IF(U305=\"\",\"\",VLOOKUP(U305,Tabelle!$B$4:$Q$6,16,FALSE)))","v":""},null,null,null,null,null,null,null,{"$f":"IF(B305=\"\",0,IF(B305=B304,COUNTIF(B$9:B304,B305)+1,1))","v":293},0,0]
["298","-1900","-1900-294",null,null,null,null,null,null,null,null,null,null,null,null,null,null,null,null,null,null,{"$f":"IF(M$1019=1,\"\",IF(U306=\"\",\"\",VLOOKUP(U306,Tabelle!$B$4:$O$6,14,FALSE)))","v":""},{"$f":"IF(M$1019=1,\"\",IF(U306=\"\",\"\",VLOOKUP(U306,Tabelle!$B$4:$Q$6,16,FALSE)))","v":""},null,null,null,null,null,null,null,{"$f":"IF(B306=\"\",0,IF(B306=B305,COUNTIF(B$9:B305,B306)+1,1))","v":294},0,0]
["299","-1900",{"$f":"IF(M$1019=1,0,B307&\"-\"&AE307)","v":"-1900-295"},null,null,null,null,null,null,null,null,null,null,null,null,null,null,null,null,null,null,{"$f":"IF(M$1019=1,\"\",IF(U307=\"\",\"\",VLOOKUP(U307,Tabelle!$B$4:$O$6,14,FALSE)))","v":""},{"$f":"IF(M$1019=1,\"\",IF(U307=\"\",\"\",VLOOKUP(U307,Tabelle!$B$4:$Q$6,16,FALSE)))","v":""},null,null,null,null,null,null,null,{"$f":"IF(B307=\"\",0,IF(B307=B306,COUNTIF(B$9:B306,B307)+1,1))","v":295},0,0]
["300","-1900","-1900-296",null,null,null,null,null,null,null,null,null,null,null,null,null,null,null,null,null,null,{"$f":"IF(M$1019=1,\"\",IF(U308=\"\",\"\",VLOOKUP(U308,Tabelle!$B$4:$O$6,14,FALSE)))","v":""},{"$f":"IF(M$1019=1,\"\",IF(U308=\"\",\"\",VLOOKUP(U308,Tabelle!$B$4:$Q$6,16,FALSE)))","v":""},null,null,null,null,null,null,null,{"$f":"IF(B308=\"\",0,IF(B308=B307,COUNTIF(B$9:B307,B308)+1,1))","v":296},0,0]
["301","-1900","-1900-297",null,null,null,null,null,null,null,null,null,null,null,null,null,null,null,null,null,null,{"$f":"IF(M$1019=1,\"\",IF(U309=\"\",\"\",VLOOKUP(U309,Tabelle!$B$4:$O$6,14,FALSE)))","v":""},{"$f":"IF(M$1019=1,\"\",IF(U309=\"\",\"\",VLOOKUP(U309,Tabelle!$B$4:$Q$6,16,FALSE)))","v":""},null,null,null,null,null,null,null,{"$f":"IF(B309=\"\",0,IF(B309=B308,COUNTIF(B$9:B308,B309)+1,1))","v":297},0,0]
["302","-1900","-1900-298",null,null,null,null,null,null,null,null,null,null,null,null,null,null,null,null,null,null,{"$f":"IF(M$1019=1,\"\",IF(U310=\"\",\"\",VLOOKUP(U310,Tabelle!$B$4:$O$6,14,FALSE)))","v":""},{"$f":"IF(M$1019=1,\"\",IF(U310=\"\",\"\",VLOOKUP(U310,Tabelle!$B$4:$Q$6,16,FALSE)))","v":""},null,null,null,null,null,null,null,{"$f":"IF(B310=\"\",0,IF(B310=B309,COUNTIF(B$9:B309,B310)+1,1))","v":298},0,0]
["303","-1900","-1900-299",null,null,null,null,null,null,null,null,null,null,null,null,null,null,null,null,null,null,{"$f":"IF(M$1019=1,\"\",IF(U311=\"\",\"\",VLOOKUP(U311,Tabelle!$B$4:$O$6,14,FALSE)))","v":""},{"$f":"IF(M$1019=1,\"\",IF(U311=\"\",\"\",VLOOKUP(U311,Tabelle!$B$4:$Q$6,16,FALSE)))","v":""},null,null,null,null,null,null,null,{"$f":"IF(B311=\"\",0,IF(B311=B310,COUNTIF(B$9:B310,B311)+1,1))","v":299},0,0]
["304","-1900","-1900-300",null,null,null,null,null,null,null,null,null,null,null,null,null,null,null,null,null,null,{"$f":"IF(M$1019=1,\"\",IF(U312=\"\",\"\",VLOOKUP(U312,Tabelle!$B$4:$O$6,14,FALSE)))","v":""},{"$f":"IF(M$1019=1,\"\",IF(U312=\"\",\"\",VLOOKUP(U312,Tabelle!$B$4:$Q$6,16,FALSE)))","v":""},null,null,null,null,null,null,null,{"$f":"IF(B312=\"\",0,IF(B312=B311,COUNTIF(B$9:B311,B312)+1,1))","v":300},0,0]
["305","-1900","-1900-301",null,null,null,null,null,null,null,null,null,null,null,null,null,null,null,null,null,null,{"$f":"IF(M$1019=1,\"\",IF(U313=\"\",\"\",VLOOKUP(U313,Tabelle!$B$4:$O$6,14,FALSE)))","v":""},{"$f":"IF(M$1019=1,\"\",IF(U313=\"\",\"\",VLOOKUP(U313,Tabelle!$B$4:$Q$6,16,FALSE)))","v":""},null,null,null,null,null,null,null,{"$f":"IF(B313=\"\",0,IF(B313=B312,COUNTIF(B$9:B312,B313)+1,1))","v":301},0,0]
["306","-1900","-1900-302",null,null,null,null,null,null,null,null,null,null,null,null,null,null,null,null,null,null,{"$f":"IF(M$1019=1,\"\",IF(U314=\"\",\"\",VLOOKUP(U314,Tabelle!$B$4:$O$6,14,FALSE)))","v":""},{"$f":"IF(M$1019=1,\"\",IF(U314=\"\",\"\",VLOOKUP(U314,Tabelle!$B$4:$Q$6,16,FALSE)))","v":""},null,null,null,null,null,null,null,{"$f":"IF(B314=\"\",0,IF(B314=B313,COUNTIF(B$9:B313,B314)+1,1))","v":302},0,0]
["307","-1900","-1900-303",null,null,null,null,null,null,null,null,null,null,null,null,null,null,null,null,null,null,{"$f":"IF(M$1019=1,\"\",IF(U315=\"\",\"\",VLOOKUP(U315,Tabelle!$B$4:$O$6,14,FALSE)))","v":""},{"$f":"IF(M$1019=1,\"\",IF(U315=\"\",\"\",VLOOKUP(U315,Tabelle!$B$4:$Q$6,16,FALSE)))","v":""},null,null,null,null,null,null,null,{"$f":"IF(B315=\"\",0,IF(B315=B314,COUNTIF(B$9:B314,B315)+1,1))","v":303},0,0]
["308","-1900","-1900-304",null,null,null,null,null,null,null,null,null,null,null,null,null,null,null,null,null,null,{"$f":"IF(M$1019=1,\"\",IF(U316=\"\",\"\",VLOOKUP(U316,Tabelle!$B$4:$O$6,14,FALSE)))","v":""},{"$f":"IF(M$1019=1,\"\",IF(U316=\"\",\"\",VLOOKUP(U316,Tabelle!$B$4:$Q$6,16,FALSE)))","v":""},null,null,null,null,null,null,null,{"$f":"IF(B316=\"\",0,IF(B316=B315,COUNTIF(B$9:B315,B316)+1,1))","v":304},0,0]
["309","-1900","-1900-305",null,null,null,null,null,null,null,null,null,null,null,null,null,null,null,null,null,null,{"$f":"IF(M$1019=1,\"\",IF(U317=\"\",\"\",VLOOKUP(U317,Tabelle!$B$4:$O$6,14,FALSE)))","v":""},{"$f":"IF(M$1019=1,\"\",IF(U317=\"\",\"\",VLOOKUP(U317,Tabelle!$B$4:$Q$6,16,FALSE)))","v":""},null,null,null,null,null,null,null,{"$f":"IF(B317=\"\",0,IF(B317=B316,COUNTIF(B$9:B316,B317)+1,1))","v":305},0,0]
["310","-1900","-1900-306",null,null,null,null,null,null,null,null,null,null,null,null,null,null,null,null,null,null,{"$f":"IF(M$1019=1,\"\",IF(U318=\"\",\"\",VLOOKUP(U318,Tabelle!$B$4:$O$6,14,FALSE)))","v":""},{"$f":"IF(M$1019=1,\"\",IF(U318=\"\",\"\",VLOOKUP(U318,Tabelle!$B$4:$Q$6,16,FALSE)))","v":""},null,null,null,null,null,null,null,{"$f":"IF(B318=\"\",0,IF(B318=B317,COUNTIF(B$9:B317,B318)+1,1))","v":306},0,0]
["311","-1900","-1900-307",null,null,null,null,null,null,null,null,null,null,null,null,null,null,null,null,null,null,{"$f":"IF(M$1019=1,\"\",IF(U319=\"\",\"\",VLOOKUP(U319,Tabelle!$B$4:$O$6,14,FALSE)))","v":""},{"$f":"IF(M$1019=1,\"\",IF(U319=\"\",\"\",VLOOKUP(U319,Tabelle!$B$4:$Q$6,16,FALSE)))","v":""},null,null,null,null,null,null,null,{"$f":"IF(B319=\"\",0,IF(B319=B318,COUNTIF(B$9:B318,B319)+1,1))","v":307},0,0]
["312","-1900","-1900-308",null,null,null,null,null,null,null,null,null,null,null,null,null,null,null,null,null,null,{"$f":"IF(M$1019=1,\"\",IF(U320=\"\",\"\",VLOOKUP(U320,Tabelle!$B$4:$O$6,14,FALSE)))","v":""},{"$f":"IF(M$1019=1,\"\",IF(U320=\"\",\"\",VLOOKUP(U320,Tabelle!$B$4:$Q$6,16,FALSE)))","v":""},null,null,null,null,null,null,null,{"$f":"IF(B320=\"\",0,IF(B320=B319,COUNTIF(B$9:B319,B320)+1,1))","v":308},0,0]
["313","-1900","-1900-309",null,null,null,null,null,null,null,null,null,null,null,null,null,null,null,null,null,null,{"$f":"IF(M$1019=1,\"\",IF(U321=\"\",\"\",VLOOKUP(U321,Tabelle!$B$4:$O$6,14,FALSE)))","v":""},{"$f":"IF(M$1019=1,\"\",IF(U321=\"\",\"\",VLOOKUP(U321,Tabelle!$B$4:$Q$6,16,FALSE)))","v":""},null,null,null,null,null,null,null,{"$f":"IF(B321=\"\",0,IF(B321=B320,COUNTIF(B$9:B320,B321)+1,1))","v":309},0,0]
["314","-1900","-1900-310",null,null,null,null,null,null,null,null,null,null,null,null,null,null,null,null,null,null,{"$f":"IF(M$1019=1,\"\",IF(U322=\"\",\"\",VLOOKUP(U322,Tabelle!$B$4:$O$6,14,FALSE)))","v":""},{"$f":"IF(M$1019=1,\"\",IF(U322=\"\",\"\",VLOOKUP(U322,Tabelle!$B$4:$Q$6,16,FALSE)))","v":""},null,null,null,null,null,null,null,{"$f":"IF(B322=\"\",0,IF(B322=B321,COUNTIF(B$9:B321,B322)+1,1))","v":310},0,0]
["315","-1900","-1900-311",null,null,null,null,null,null,null,null,null,null,null,null,null,null,null,null,null,null,{"$f":"IF(M$1019=1,\"\",IF(U323=\"\",\"\",VLOOKUP(U323,Tabelle!$B$4:$O$6,14,FALSE)))","v":""},{"$f":"IF(M$1019=1,\"\",IF(U323=\"\",\"\",VLOOKUP(U323,Tabelle!$B$4:$Q$6,16,FALSE)))","v":""},null,null,null,null,null,null,null,{"$f":"IF(B323=\"\",0,IF(B323=B322,COUNTIF(B$9:B322,B323)+1,1))","v":311},0,0]
["316","-1900","-1900-312",null,null,null,null,null,null,null,null,null,null,null,null,null,null,null,null,null,null,{"$f":"IF(M$1019=1,\"\",IF(U324=\"\",\"\",VLOOKUP(U324,Tabelle!$B$4:$O$6,14,FALSE)))","v":""},{"$f":"IF(M$1019=1,\"\",IF(U324=\"\",\"\",VLOOKUP(U324,Tabelle!$B$4:$Q$6,16,FALSE)))","v":""},null,null,null,null,null,null,null,{"$f":"IF(B324=\"\",0,IF(B324=B323,COUNTIF(B$9:B323,B324)+1,1))","v":312},0,0]
["317","-1900","-1900-313",null,null,null,null,null,null,null,null,null,null,null,null,null,null,null,null,null,null,{"$f":"IF(M$1019=1,\"\",IF(U325=\"\",\"\",VLOOKUP(U325,Tabelle!$B$4:$O$6,14,FALSE)))","v":""},{"$f":"IF(M$1019=1,\"\",IF(U325=\"\",\"\",VLOOKUP(U325,Tabelle!$B$4:$Q$6,16,FALSE)))","v":""},null,null,null,null,null,null,null,{"$f":"IF(B325=\"\",0,IF(B325=B324,COUNTIF(B$9:B324,B325)+1,1))","v":313},0,0]
["318","-1900","-1900-314",null,null,null,null,null,null,null,null,null,null,null,null,null,null,null,null,null,null,{"$f":"IF(M$1019=1,\"\",IF(U326=\"\",\"\",VLOOKUP(U326,Tabelle!$B$4:$O$6,14,FALSE)))","v":""},{"$f":"IF(M$1019=1,\"\",IF(U326=\"\",\"\",VLOOKUP(U326,Tabelle!$B$4:$Q$6,16,FALSE)))","v":""},null,null,null,null,null,null,null,{"$f":"IF(B326=\"\",0,IF(B326=B325,COUNTIF(B$9:B325,B326)+1,1))","v":314},0,0]
["319","-1900","-1900-315",null,null,null,null,null,null,null,null,null,null,null,null,null,null,null,null,null,null,{"$f":"IF(M$1019=1,\"\",IF(U327=\"\",\"\",VLOOKUP(U327,Tabelle!$B$4:$O$6,14,FALSE)))","v":""},{"$f":"IF(M$1019=1,\"\",IF(U327=\"\",\"\",VLOOKUP(U327,Tabelle!$B$4:$Q$6,16,FALSE)))","v":""},null,null,null,null,null,null,null,{"$f":"IF(B327=\"\",0,IF(B327=B326,COUNTIF(B$9:B326,B327)+1,1))","v":315},0,0]
["320","-1900","-1900-316",null,null,null,null,null,null,null,null,null,null,null,null,null,null,null,null,null,null,{"$f":"IF(M$1019=1,\"\",IF(U328=\"\",\"\",VLOOKUP(U328,Tabelle!$B$4:$O$6,14,FALSE)))","v":""},{"$f":"IF(M$1019=1,\"\",IF(U328=\"\",\"\",VLOOKUP(U328,Tabelle!$B$4:$Q$6,16,FALSE)))","v":""},null,null,null,null,null,null,null,{"$f":"IF(B328=\"\",0,IF(B328=B327,COUNTIF(B$9:B327,B328)+1,1))","v":316},0,0]
["321","-1900","-1900-317",null,null,null,null,null,null,null,null,null,null,null,null,null,null,null,null,null,null,{"$f":"IF(M$1019=1,\"\",IF(U329=\"\",\"\",VLOOKUP(U329,Tabelle!$B$4:$O$6,14,FALSE)))","v":""},{"$f":"IF(M$1019=1,\"\",IF(U329=\"\",\"\",VLOOKUP(U329,Tabelle!$B$4:$Q$6,16,FALSE)))","v":""},null,null,null,null,null,null,null,{"$f":"IF(B329=\"\",0,IF(B329=B328,COUNTIF(B$9:B328,B329)+1,1))","v":317},0,0]
["322",{"$f":"IF(AG330=$AG$1013,0,IF(M$1019=1,0,D330&\"-\"&YEAR(E330)))","v":"-1900"},"-1900-318",null,null,null,null,null,null,null,null,null,null,null,null,null,null,null,null,null,null,{"$f":"IF(M$1019=1,\"\",IF(U330=\"\",\"\",VLOOKUP(U330,Tabelle!$B$4:$O$6,14,FALSE)))","v":""},{"$f":"IF(M$1019=1,\"\",IF(U330=\"\",\"\",VLOOKUP(U330,Tabelle!$B$4:$Q$6,16,FALSE)))","v":""},null,null,null,null,null,null,null,{"$f":"IF(B330=\"\",0,IF(B330=B329,COUNTIF(B$9:B329,B330)+1,1))","v":318},0,{"$f":"IF(E330>0,IF(OR(MONTH(E330)<$L$1030,MONTH(E330)>$L$1031),AG$1013,0),0)","v":0}]
["323","-1900","-1900-319",null,null,null,null,null,null,null,null,null,null,null,null,null,null,null,null,null,null,{"$f":"IF(M$1019=1,\"\",IF(U331=\"\",\"\",VLOOKUP(U331,Tabelle!$B$4:$O$6,14,FALSE)))","v":""},{"$f":"IF(M$1019=1,\"\",IF(U331=\"\",\"\",VLOOKUP(U331,Tabelle!$B$4:$Q$6,16,FALSE)))","v":""},null,null,null,null,null,null,null,{"$f":"IF(B331=\"\",0,IF(B331=B330,COUNTIF(B$9:B330,B331)+1,1))","v":319},0,0]
["324","-1900","-1900-320",null,null,null,null,null,null,null,null,null,null,null,null,null,null,null,null,null,null,{"$f":"IF(M$1019=1,\"\",IF(U332=\"\",\"\",VLOOKUP(U332,Tabelle!$B$4:$O$6,14,FALSE)))","v":""},{"$f":"IF(M$1019=1,\"\",IF(U332=\"\",\"\",VLOOKUP(U332,Tabelle!$B$4:$Q$6,16,FALSE)))","v":""},null,null,null,null,null,null,null,{"$f":"IF(B332=\"\",0,IF(B332=B331,COUNTIF(B$9:B331,B332)+1,1))","v":320},0,0]
["325","-1900","-1900-321",null,null,null,null,null,null,null,null,null,null,null,null,null,null,null,null,null,null,{"$f":"IF(M$1019=1,\"\",IF(U333=\"\",\"\",VLOOKUP(U333,Tabelle!$B$4:$O$6,14,FALSE)))","v":""},{"$f":"IF(M$1019=1,\"\",IF(U333=\"\",\"\",VLOOKUP(U333,Tabelle!$B$4:$Q$6,16,FALSE)))","v":""},null,null,null,null,null,null,null,{"$f":"IF(B333=\"\",0,IF(B333=B332,COUNTIF(B$9:B332,B333)+1,1))","v":321},0,0]
["326","-1900","-1900-322",null,null,null,null,null,null,null,null,null,null,null,null,null,null,null,null,null,null,{"$f":"IF(M$1019=1,\"\",IF(U334=\"\",\"\",VLOOKUP(U334,Tabelle!$B$4:$O$6,14,FALSE)))","v":""},{"$f":"IF(M$1019=1,\"\",IF(U334=\"\",\"\",VLOOKUP(U334,Tabelle!$B$4:$Q$6,16,FALSE)))","v":""},null,null,null,null,null,null,null,{"$f":"IF(B334=\"\",0,IF(B334=B333,COUNTIF(B$9:B333,B334)+1,1))","v":322},0,0]
["327","-1900","-1900-323",null,null,null,null,null,null,null,null,null,null,null,null,null,null,null,null,null,null,{"$f":"IF(M$1019=1,\"\",IF(U335=\"\",\"\",VLOOKUP(U335,Tabelle!$B$4:$O$6,14,FALSE)))","v":""},{"$f":"IF(M$1019=1,\"\",IF(U335=\"\",\"\",VLOOKUP(U335,Tabelle!$B$4:$Q$6,16,FALSE)))","v":""},null,null,null,null,null,null,null,{"$f":"IF(B335=\"\",0,IF(B335=B334,COUNTIF(B$9:B334,B335)+1,1))","v":323},0,0]
["328","-1900","-1900-324",null,null,null,null,null,null,null,null,null,null,null,null,null,null,null,null,null,null,{"$f":"IF(M$1019=1,\"\",IF(U336=\"\",\"\",VLOOKUP(U336,Tabelle!$B$4:$O$6,14,FALSE)))","v":""},{"$f":"IF(M$1019=1,\"\",IF(U336=\"\",\"\",VLOOKUP(U336,Tabelle!$B$4:$Q$6,16,FALSE)))","v":""},null,null,null,null,null,null,null,{"$f":"IF(B336=\"\",0,IF(B336=B335,COUNTIF(B$9:B335,B336)+1,1))","v":324},0,0]
["329","-1900","-1900-325",null,null,null,null,null,null,null,null,null,null,null,null,null,null,null,null,null,null,{"$f":"IF(M$1019=1,\"\",IF(U337=\"\",\"\",VLOOKUP(U337,Tabelle!$B$4:$O$6,14,FALSE)))","v":""},{"$f":"IF(M$1019=1,\"\",IF(U337=\"\",\"\",VLOOKUP(U337,Tabelle!$B$4:$Q$6,16,FALSE)))","v":""},null,null,null,null,null,null,null,{"$f":"IF(B337=\"\",0,IF(B337=B336,COUNTIF(B$9:B336,B337)+1,1))","v":325},0,0]
["330","-1900","-1900-326",null,null,null,null,null,null,null,null,null,null,null,null,null,null,null,null,null,null,{"$f":"IF(M$1019=1,\"\",IF(U338=\"\",\"\",VLOOKUP(U338,Tabelle!$B$4:$O$6,14,FALSE)))","v":""},{"$f":"IF(M$1019=1,\"\",IF(U338=\"\",\"\",VLOOKUP(U338,Tabelle!$B$4:$Q$6,16,FALSE)))","v":""},null,null,null,null,null,null,null,{"$f":"IF(B338=\"\",0,IF(B338=B337,COUNTIF(B$9:B337,B338)+1,1))","v":326},0,0]
["331","-1900","-1900-327",null,null,null,null,null,null,null,null,null,null,null,null,null,null,null,null,null,null,{"$f":"IF(M$1019=1,\"\",IF(U339=\"\",\"\",VLOOKUP(U339,Tabelle!$B$4:$O$6,14,FALSE)))","v":""},{"$f":"IF(M$1019=1,\"\",IF(U339=\"\",\"\",VLOOKUP(U339,Tabelle!$B$4:$Q$6,16,FALSE)))","v":""},null,null,null,null,null,null,null,{"$f":"IF(B339=\"\",0,IF(B339=B338,COUNTIF(B$9:B338,B339)+1,1))","v":327},0,0]
["332","-1900","-1900-328",null,null,null,null,null,null,null,null,null,null,null,null,null,null,null,null,null,null,{"$f":"IF(M$1019=1,\"\",IF(U340=\"\",\"\",VLOOKUP(U340,Tabelle!$B$4:$O$6,14,FALSE)))","v":""},{"$f":"IF(M$1019=1,\"\",IF(U340=\"\",\"\",VLOOKUP(U340,Tabelle!$B$4:$Q$6,16,FALSE)))","v":""},null,null,null,null,null,null,null,{"$f":"IF(B340=\"\",0,IF(B340=B339,COUNTIF(B$9:B339,B340)+1,1))","v":328},{"$f":"IF(OR(D340=\"\",M$1019=1),0,IF(AE340=8,1,0))","v":0},0]
["333","-1900","-1900-329",null,null,null,null,null,null,null,null,null,null,null,null,null,null,null,null,null,null,{"$f":"IF(M$1019=1,\"\",IF(U341=\"\",\"\",VLOOKUP(U341,Tabelle!$B$4:$O$6,14,FALSE)))","v":""},{"$f":"IF(M$1019=1,\"\",IF(U341=\"\",\"\",VLOOKUP(U341,Tabelle!$B$4:$Q$6,16,FALSE)))","v":""},null,null,null,null,null,null,null,{"$f":"IF(B341=\"\",0,IF(B341=B340,COUNTIF(B$9:B340,B341)+1,1))","v":329},0,0]
["334","-1900","-1900-330",null,null,null,null,null,null,null,null,null,null,null,null,null,null,null,null,null,null,{"$f":"IF(M$1019=1,\"\",IF(U342=\"\",\"\",VLOOKUP(U342,Tabelle!$B$4:$O$6,14,FALSE)))","v":""},{"$f":"IF(M$1019=1,\"\",IF(U342=\"\",\"\",VLOOKUP(U342,Tabelle!$B$4:$Q$6,16,FALSE)))","v":""},null,null,null,null,null,null,null,{"$f":"IF(B342=\"\",0,IF(B342=B341,COUNTIF(B$9:B341,B342)+1,1))","v":330},0,0]
["335","-1900","-1900-331",null,null,null,null,null,null,null,null,null,null,null,null,null,null,null,null,null,null,{"$f":"IF(M$1019=1,\"\",IF(U343=\"\",\"\",VLOOKUP(U343,Tabelle!$B$4:$O$6,14,FALSE)))","v":""},{"$f":"IF(M$1019=1,\"\",IF(U343=\"\",\"\",VLOOKUP(U343,Tabelle!$B$4:$Q$6,16,FALSE)))","v":""},null,null,null,null,null,null,null,{"$f":"IF(B343=\"\",0,IF(B343=B342,COUNTIF(B$9:B342,B343)+1,1))","v":331},0,0]
["336","-1900","-1900-332",null,null,null,null,null,null,null,null,null,null,null,null,null,null,null,null,null,null,{"$f":"IF(M$1019=1,\"\",IF(U344=\"\",\"\",VLOOKUP(U344,Tabelle!$B$4:$O$6,14,FALSE)))","v":""},{"$f":"IF(M$1019=1,\"\",IF(U344=\"\",\"\",VLOOKUP(U344,Tabelle!$B$4:$Q$6,16,FALSE)))","v":""},null,null,null,null,null,null,null,{"$f":"IF(B344=\"\",0,IF(B344=B343,COUNTIF(B$9:B343,B344)+1,1))","v":332},0,0]
["337","-1900","-1900-333",null,null,null,null,null,null,null,null,null,null,null,null,null,null,null,null,null,null,{"$f":"IF(M$1019=1,\"\",IF(U345=\"\",\"\",VLOOKUP(U345,Tabelle!$B$4:$O$6,14,FALSE)))","v":""},{"$f":"IF(M$1019=1,\"\",IF(U345=\"\",\"\",VLOOKUP(U345,Tabelle!$B$4:$Q$6,16,FALSE)))","v":""},null,null,null,null,null,null,null,{"$f":"IF(B345=\"\",0,IF(B345=B344,COUNTIF(B$9:B344,B345)+1,1))","v":333},0,0]
["338","-1900","-1900-334",null,null,null,null,null,null,null,null,null,null,null,null,null,null,null,null,null,null,{"$f":"IF(M$1019=1,\"\",IF(U346=\"\",\"\",VLOOKUP(U346,Tabelle!$B$4:$O$6,14,FALSE)))","v":""},{"$f":"IF(M$1019=1,\"\",IF(U346=\"\",\"\",VLOOKUP(U346,Tabelle!$B$4:$Q$6,16,FALSE)))","v":""},null,null,null,null,null,null,null,{"$f":"IF(B346=\"\",0,IF(B346=B345,COUNTIF(B$9:B345,B346)+1,1))","v":334},0,0]
["339","-1900","-1900-335",null,null,null,null,null,null,null,null,null,null,null,null,null,null,null,null,null,null,{"$f":"IF(M$1019=1,\"\",IF(U347=\"\",\"\",VLOOKUP(U347,Tabelle!$B$4:$O$6,14,FALSE)))","v":""},{"$f":"IF(M$1019=1,\"\",IF(U347=\"\",\"\",VLOOKUP(U347,Tabelle!$B$4:$Q$6,16,FALSE)))","v":""},null,null,null,null,null,null,null,{"$f":"IF(B347=\"\",0,IF(B347=B346,COUNTIF(B$9:B346,B347)+1,1))","v":335},0,0]
["340","-1900","-1900-336",null,null,null,null,null,null,null,null,null,null,null,null,null,null,null,null,null,null,{"$f":"IF(M$1019=1,\"\",IF(U348=\"\",\"\",VLOOKUP(U348,Tabelle!$B$4:$O$6,14,FALSE)))","v":""},{"$f":"IF(M$1019=1,\"\",IF(U348=\"\",\"\",VLOOKUP(U348,Tabelle!$B$4:$Q$6,16,FALSE)))","v":""},null,null,null,null,null,null,null,{"$f":"IF(B348=\"\",0,IF(B348=B347,COUNTIF(B$9:B347,B348)+1,1))","v":336},0,0]
["341","-1900","-1900-337",null,null,null,null,null,null,null,null,null,null,null,null,null,null,null,null,null,null,{"$f":"IF(M$1019=1,\"\",IF(U349=\"\",\"\",VLOOKUP(U349,Tabelle!$B$4:$O$6,14,FALSE)))","v":""},{"$f":"IF(M$1019=1,\"\",IF(U349=\"\",\"\",VLOOKUP(U349,Tabelle!$B$4:$Q$6,16,FALSE)))","v":""},null,null,null,null,null,null,null,{"$f":"IF(B349=\"\",0,IF(B349=B348,COUNTIF(B$9:B348,B349)+1,1))","v":337},0,0]
["342","-1900","-1900-338",null,null,null,null,null,null,null,null,null,null,null,null,null,null,null,null,null,null,{"$f":"IF(M$1019=1,\"\",IF(U350=\"\",\"\",VLOOKUP(U350,Tabelle!$B$4:$O$6,14,FALSE)))","v":""},{"$f":"IF(M$1019=1,\"\",IF(U350=\"\",\"\",VLOOKUP(U350,Tabelle!$B$4:$Q$6,16,FALSE)))","v":""},null,null,null,null,null,null,null,{"$f":"IF(B350=\"\",0,IF(B350=B349,COUNTIF(B$9:B349,B350)+1,1))","v":338},0,0]
["343","-1900","-1900-339",null,null,null,null,null,null,null,null,null,null,null,null,null,null,null,null,null,null,{"$f":"IF(M$1019=1,\"\",IF(U351=\"\",\"\",VLOOKUP(U351,Tabelle!$B$4:$O$6,14,FALSE)))","v":""},{"$f":"IF(M$1019=1,\"\",IF(U351=\"\",\"\",VLOOKUP(U351,Tabelle!$B$4:$Q$6,16,FALSE)))","v":""},null,null,null,null,null,null,null,{"$f":"IF(B351=\"\",0,IF(B351=B350,COUNTIF(B$9:B350,B351)+1,1))","v":339},0,0]
["344","-1900","-1900-340",null,null,null,null,null,null,null,null,null,null,null,null,null,null,null,null,null,null,{"$f":"IF(M$1019=1,\"\",IF(U352=\"\",\"\",VLOOKUP(U352,Tabelle!$B$4:$O$6,14,FALSE)))","v":""},{"$f":"IF(M$1019=1,\"\",IF(U352=\"\",\"\",VLOOKUP(U352,Tabelle!$B$4:$Q$6,16,FALSE)))","v":""},null,null,null,null,null,null,null,{"$f":"IF(B352=\"\",0,IF(B352=B351,COUNTIF(B$9:B351,B352)+1,1))","v":340},0,0]
["345","-1900","-1900-341",null,null,null,null,null,null,null,null,null,null,null,null,null,null,null,null,null,null,{"$f":"IF(M$1019=1,\"\",IF(U353=\"\",\"\",VLOOKUP(U353,Tabelle!$B$4:$O$6,14,FALSE)))","v":""},{"$f":"IF(M$1019=1,\"\",IF(U353=\"\",\"\",VLOOKUP(U353,Tabelle!$B$4:$Q$6,16,FALSE)))","v":""},null,null,null,null,null,null,null,{"$f":"IF(B353=\"\",0,IF(B353=B352,COUNTIF(B$9:B352,B353)+1,1))","v":341},0,0]
["346","-1900","-1900-342",null,null,null,null,null,null,null,null,null,null,null,null,null,null,null,null,null,null,{"$f":"IF(M$1019=1,\"\",IF(U354=\"\",\"\",VLOOKUP(U354,Tabelle!$B$4:$O$6,14,FALSE)))","v":""},{"$f":"IF(M$1019=1,\"\",IF(U354=\"\",\"\",VLOOKUP(U354,Tabelle!$B$4:$Q$6,16,FALSE)))","v":""},null,null,null,null,null,null,null,{"$f":"IF(B354=\"\",0,IF(B354=B353,COUNTIF(B$9:B353,B354)+1,1))","v":342},0,0]
["347","-1900","-1900-343",null,null,null,null,null,null,null,null,null,null,null,null,null,null,null,null,null,null,{"$f":"IF(M$1019=1,\"\",IF(U355=\"\",\"\",VLOOKUP(U355,Tabelle!$B$4:$O$6,14,FALSE)))","v":""},{"$f":"IF(M$1019=1,\"\",IF(U355=\"\",\"\",VLOOKUP(U355,Tabelle!$B$4:$Q$6,16,FALSE)))","v":""},null,null,null,null,null,null,null,{"$f":"IF(B355=\"\",0,IF(B355=B354,COUNTIF(B$9:B354,B355)+1,1))","v":343},0,0]
["348","-1900","-1900-344",null,null,null,null,null,null,null,null,null,null,null,null,null,null,null,null,null,null,{"$f":"IF(M$1019=1,\"\",IF(U356=\"\",\"\",VLOOKUP(U356,Tabelle!$B$4:$O$6,14,FALSE)))","v":""},{"$f":"IF(M$1019=1,\"\",IF(U356=\"\",\"\",VLOOKUP(U356,Tabelle!$B$4:$Q$6,16,FALSE)))","v":""},null,null,null,null,null,null,null,{"$f":"IF(B356=\"\",0,IF(B356=B355,COUNTIF(B$9:B355,B356)+1,1))","v":344},0,0]
["349","-1900","-1900-345",null,null,null,null,null,null,null,null,null,null,null,null,null,null,null,null,null,null,{"$f":"IF(M$1019=1,\"\",IF(U357=\"\",\"\",VLOOKUP(U357,Tabelle!$B$4:$O$6,14,FALSE)))","v":""},{"$f":"IF(M$1019=1,\"\",IF(U357=\"\",\"\",VLOOKUP(U357,Tabelle!$B$4:$Q$6,16,FALSE)))","v":""},null,null,null,null,null,null,null,{"$f":"IF(B357=\"\",0,IF(B357=B356,COUNTIF(B$9:B356,B357)+1,1))","v":345},0,0]
["350","-1900","-1900-346",null,null,null,null,null,null,null,null,null,null,null,null,null,null,null,null,null,null,{"$f":"IF(M$1019=1,\"\",IF(U358=\"\",\"\",VLOOKUP(U358,Tabelle!$B$4:$O$6,14,FALSE)))","v":""},{"$f":"IF(M$1019=1,\"\",IF(U358=\"\",\"\",VLOOKUP(U358,Tabelle!$B$4:$Q$6,16,FALSE)))","v":""},null,null,null,null,null,null,null,{"$f":"IF(B358=\"\",0,IF(B358=B357,COUNTIF(B$9:B357,B358)+1,1))","v":346},0,0]
["351","-1900","-1900-347",null,null,null,null,null,null,null,null,null,null,null,null,null,null,null,null,null,null,{"$f":"IF(M$1019=1,\"\",IF(U359=\"\",\"\",VLOOKUP(U359,Tabelle!$B$4:$O$6,14,FALSE)))","v":""},{"$f":"IF(M$1019=1,\"\",IF(U359=\"\",\"\",VLOOKUP(U359,Tabelle!$B$4:$Q$6,16,FALSE)))","v":""},null,null,null,null,null,null,null,{"$f":"IF(B359=\"\",0,IF(B359=B358,COUNTIF(B$9:B358,B359)+1,1))","v":347},0,0]
["352","-1900","-1900-348",null,null,null,null,null,null,null,null,null,null,null,null,null,null,null,null,null,null,{"$f":"IF(M$1019=1,\"\",IF(U360=\"\",\"\",VLOOKUP(U360,Tabelle!$B$4:$O$6,14,FALSE)))","v":""},{"$f":"IF(M$1019=1,\"\",IF(U360=\"\",\"\",VLOOKUP(U360,Tabelle!$B$4:$Q$6,16,FALSE)))","v":""},null,null,null,null,null,null,null,{"$f":"IF(B360=\"\",0,IF(B360=B359,COUNTIF(B$9:B359,B360)+1,1))","v":348},0,0]
["353","-1900","-1900-349",null,null,null,null,null,null,null,null,null,null,null,null,null,null,null,null,null,null,{"$f":"IF(M$1019=1,\"\",IF(U361=\"\",\"\",VLOOKUP(U361,Tabelle!$B$4:$O$6,14,FALSE)))","v":""},{"$f":"IF(M$1019=1,\"\",IF(U361=\"\",\"\",VLOOKUP(U361,Tabelle!$B$4:$Q$6,16,FALSE)))","v":""},null,null,null,null,null,null,null,{"$f":"IF(B361=\"\",0,IF(B361=B360,COUNTIF(B$9:B360,B361)+1,1))","v":349},0,0]
["354","-1900","-1900-350",null,null,null,null,null,null,null,null,null,null,null,null,null,null,null,null,null,null,{"$f":"IF(M$1019=1,\"\",IF(U362=\"\",\"\",VLOOKUP(U362,Tabelle!$B$4:$O$6,14,FALSE)))","v":""},{"$f":"IF(M$1019=1,\"\",IF(U362=\"\",\"\",VLOOKUP(U362,Tabelle!$B$4:$Q$6,16,FALSE)))","v":""},null,null,null,null,null,null,null,{"$f":"IF(B362=\"\",0,IF(B362=B361,COUNTIF(B$9:B361,B362)+1,1))","v":350},0,0]
["355","-1900","-1900-351",null,null,null,null,null,null,null,null,null,null,null,null,null,null,null,null,null,null,{"$f":"IF(M$1019=1,\"\",IF(U363=\"\",\"\",VLOOKUP(U363,Tabelle!$B$4:$O$6,14,FALSE)))","v":""},{"$f":"IF(M$1019=1,\"\",IF(U363=\"\",\"\",VLOOKUP(U363,Tabelle!$B$4:$Q$6,16,FALSE)))","v":""},null,null,null,null,null,null,null,{"$f":"IF(B363=\"\",0,IF(B363=B362,COUNTIF(B$9:B362,B363)+1,1))","v":351},0,0]
["356","-1900","-1900-352",null,null,null,null,null,null,null,null,null,null,null,null,null,null,null,null,null,null,{"$f":"IF(M$1019=1,\"\",IF(U364=\"\",\"\",VLOOKUP(U364,Tabelle!$B$4:$O$6,14,FALSE)))","v":""},{"$f":"IF(M$1019=1,\"\",IF(U364=\"\",\"\",VLOOKUP(U364,Tabelle!$B$4:$Q$6,16,FALSE)))","v":""},null,null,null,null,null,null,null,{"$f":"IF(B364=\"\",0,IF(B364=B363,COUNTIF(B$9:B363,B364)+1,1))","v":352},0,0]
["357","-1900","-1900-353",null,null,null,null,null,null,null,null,null,null,null,null,null,null,null,null,null,null,{"$f":"IF(M$1019=1,\"\",IF(U365=\"\",\"\",VLOOKUP(U365,Tabelle!$B$4:$O$6,14,FALSE)))","v":""},{"$f":"IF(M$1019=1,\"\",IF(U365=\"\",\"\",VLOOKUP(U365,Tabelle!$B$4:$Q$6,16,FALSE)))","v":""},null,null,null,null,null,null,null,{"$f":"IF(B365=\"\",0,IF(B365=B364,COUNTIF(B$9:B364,B365)+1,1))","v":353},0,0]
["358","-1900","-1900-354",null,null,null,null,null,null,null,null,null,null,null,null,null,null,null,null,null,null,{"$f":"IF(M$1019=1,\"\",IF(U366=\"\",\"\",VLOOKUP(U366,Tabelle!$B$4:$O$6,14,FALSE)))","v":""},{"$f":"IF(M$1019=1,\"\",IF(U366=\"\",\"\",VLOOKUP(U366,Tabelle!$B$4:$Q$6,16,FALSE)))","v":""},null,null,null,null,null,null,null,{"$f":"IF(B366=\"\",0,IF(B366=B365,COUNTIF(B$9:B365,B366)+1,1))","v":354},0,0]
["359","-1900","-1900-355",null,null,null,null,null,null,null,null,null,null,null,null,null,null,null,null,null,null,{"$f":"IF(M$1019=1,\"\",IF(U367=\"\",\"\",VLOOKUP(U367,Tabelle!$B$4:$O$6,14,FALSE)))","v":""},{"$f":"IF(M$1019=1,\"\",IF(U367=\"\",\"\",VLOOKUP(U367,Tabelle!$B$4:$Q$6,16,FALSE)))","v":""},null,null,null,null,null,null,null,{"$f":"IF(B367=\"\",0,IF(B367=B366,COUNTIF(B$9:B366,B367)+1,1))","v":355},0,0]
["360","-1900","-1900-356",null,null,null,null,null,null,null,null,null,null,null,null,null,null,null,null,null,null,{"$f":"IF(M$1019=1,\"\",IF(U368=\"\",\"\",VLOOKUP(U368,Tabelle!$B$4:$O$6,14,FALSE)))","v":""},{"$f":"IF(M$1019=1,\"\",IF(U368=\"\",\"\",VLOOKUP(U368,Tabelle!$B$4:$Q$6,16,FALSE)))","v":""},null,null,null,null,null,null,null,{"$f":"IF(B368=\"\",0,IF(B368=B367,COUNTIF(B$9:B367,B368)+1,1))","v":356},0,0]
["361","-1900","-1900-357",null,null,null,null,null,null,null,null,null,null,null,null,null,null,null,null,null,null,{"$f":"IF(M$1019=1,\"\",IF(U369=\"\",\"\",VLOOKUP(U369,Tabelle!$B$4:$O$6,14,FALSE)))","v":""},{"$f":"IF(M$1019=1,\"\",IF(U369=\"\",\"\",VLOOKUP(U369,Tabelle!$B$4:$Q$6,16,FALSE)))","v":""},null,null,null,null,null,null,null,{"$f":"IF(B369=\"\",0,IF(B369=B368,COUNTIF(B$9:B368,B369)+1,1))","v":357},0,0]
["362","-1900","-1900-358",null,null,null,null,null,null,null,null,null,null,null,null,null,null,null,null,null,null,{"$f":"IF(M$1019=1,\"\",IF(U370=\"\",\"\",VLOOKUP(U370,Tabelle!$B$4:$O$6,14,FALSE)))","v":""},{"$f":"IF(M$1019=1,\"\",IF(U370=\"\",\"\",VLOOKUP(U370,Tabelle!$B$4:$Q$6,16,FALSE)))","v":""},null,null,null,null,null,null,null,{"$f":"IF(B370=\"\",0,IF(B370=B369,COUNTIF(B$9:B369,B370)+1,1))","v":358},0,0]
["363","-1900",{"$f":"IF(M$1019=1,0,B371&\"-\"&AE371)","v":"-1900-359"},null,null,null,null,null,null,null,null,null,null,null,null,null,null,null,null,null,null,{"$f":"IF(M$1019=1,\"\",IF(U371=\"\",\"\",VLOOKUP(U371,Tabelle!$B$4:$O$6,14,FALSE)))","v":""},{"$f":"IF(M$1019=1,\"\",IF(U371=\"\",\"\",VLOOKUP(U371,Tabelle!$B$4:$Q$6,16,FALSE)))","v":""},null,null,null,null,null,null,null,{"$f":"IF(B371=\"\",0,IF(B371=B370,COUNTIF(B$9:B370,B371)+1,1))","v":359},0,0]
["364","-1900","-1900-360",null,null,null,null,null,null,null,null,null,null,null,null,null,null,null,null,null,null,{"$f":"IF(M$1019=1,\"\",IF(U372=\"\",\"\",VLOOKUP(U372,Tabelle!$B$4:$O$6,14,FALSE)))","v":""},{"$f":"IF(M$1019=1,\"\",IF(U372=\"\",\"\",VLOOKUP(U372,Tabelle!$B$4:$Q$6,16,FALSE)))","v":""},null,null,null,null,null,null,null,{"$f":"IF(B372=\"\",0,IF(B372=B371,COUNTIF(B$9:B371,B372)+1,1))","v":360},0,0]
["365","-1900","-1900-361",null,null,null,null,null,null,null,null,null,null,null,null,null,null,null,null,null,null,{"$f":"IF(M$1019=1,\"\",IF(U373=\"\",\"\",VLOOKUP(U373,Tabelle!$B$4:$O$6,14,FALSE)))","v":""},{"$f":"IF(M$1019=1,\"\",IF(U373=\"\",\"\",VLOOKUP(U373,Tabelle!$B$4:$Q$6,16,FALSE)))","v":""},null,null,null,null,null,null,null,{"$f":"IF(B373=\"\",0,IF(B373=B372,COUNTIF(B$9:B372,B373)+1,1))","v":361},0,0]
["366","-1900","-1900-362",null,null,null,null,null,null,null,null,null,null,null,null,null,null,null,null,null,null,{"$f":"IF(M$1019=1,\"\",IF(U374=\"\",\"\",VLOOKUP(U374,Tabelle!$B$4:$O$6,14,FALSE)))","v":""},{"$f":"IF(M$1019=1,\"\",IF(U374=\"\",\"\",VLOOKUP(U374,Tabelle!$B$4:$Q$6,16,FALSE)))","v":""},null,null,null,null,null,null,null,{"$f":"IF(B374=\"\",0,IF(B374=B373,COUNTIF(B$9:B373,B374)+1,1))","v":362},0,0]
["367","-1900","-1900-363",null,null,null,null,null,null,null,null,null,null,null,null,null,null,null,null,null,null,{"$f":"IF(M$1019=1,\"\",IF(U375=\"\",\"\",VLOOKUP(U375,Tabelle!$B$4:$O$6,14,FALSE)))","v":""},{"$f":"IF(M$1019=1,\"\",IF(U375=\"\",\"\",VLOOKUP(U375,Tabelle!$B$4:$Q$6,16,FALSE)))","v":""},null,null,null,null,null,null,null,{"$f":"IF(B375=\"\",0,IF(B375=B374,COUNTIF(B$9:B374,B375)+1,1))","v":363},0,0]
["368","-1900","-1900-364",null,null,null,null,null,null,null,null,null,null,null,null,null,null,null,null,null,null,{"$f":"IF(M$1019=1,\"\",IF(U376=\"\",\"\",VLOOKUP(U376,Tabelle!$B$4:$O$6,14,FALSE)))","v":""},{"$f":"IF(M$1019=1,\"\",IF(U376=\"\",\"\",VLOOKUP(U376,Tabelle!$B$4:$Q$6,16,FALSE)))","v":""},null,null,null,null,null,null,null,{"$f":"IF(B376=\"\",0,IF(B376=B375,COUNTIF(B$9:B375,B376)+1,1))","v":364},0,0]
["369","-1900","-1900-365",null,null,null,null,null,null,null,null,null,null,null,null,null,null,null,null,null,null,{"$f":"IF(M$1019=1,\"\",IF(U377=\"\",\"\",VLOOKUP(U377,Tabelle!$B$4:$O$6,14,FALSE)))","v":""},{"$f":"IF(M$1019=1,\"\",IF(U377=\"\",\"\",VLOOKUP(U377,Tabelle!$B$4:$Q$6,16,FALSE)))","v":""},null,null,null,null,null,null,null,{"$f":"IF(B377=\"\",0,IF(B377=B376,COUNTIF(B$9:B376,B377)+1,1))","v":365},0,0]
["370","-1900","-1900-366",null,null,null,null,null,null,null,null,null,null,null,null,null,null,null,null,null,null,{"$f":"IF(M$1019=1,\"\",IF(U378=\"\",\"\",VLOOKUP(U378,Tabelle!$B$4:$O$6,14,FALSE)))","v":""},{"$f":"IF(M$1019=1,\"\",IF(U378=\"\",\"\",VLOOKUP(U378,Tabelle!$B$4:$Q$6,16,FALSE)))","v":""},null,null,null,null,null,null,null,{"$f":"IF(B378=\"\",0,IF(B378=B377,COUNTIF(B$9:B377,B378)+1,1))","v":366},0,0]
["371","-1900","-1900-367",null,null,null,null,null,null,null,null,null,null,null,null,null,null,null,null,null,null,{"$f":"IF(M$1019=1,\"\",IF(U379=\"\",\"\",VLOOKUP(U379,Tabelle!$B$4:$O$6,14,FALSE)))","v":""},{"$f":"IF(M$1019=1,\"\",IF(U379=\"\",\"\",VLOOKUP(U379,Tabelle!$B$4:$Q$6,16,FALSE)))","v":""},null,null,null,null,null,null,null,{"$f":"IF(B379=\"\",0,IF(B379=B378,COUNTIF(B$9:B378,B379)+1,1))","v":367},0,0]
["372","-1900","-1900-368",null,null,null,null,null,null,null,null,null,null,null,null,null,null,null,null,null,null,{"$f":"IF(M$1019=1,\"\",IF(U380=\"\",\"\",VLOOKUP(U380,Tabelle!$B$4:$O$6,14,FALSE)))","v":""},{"$f":"IF(M$1019=1,\"\",IF(U380=\"\",\"\",VLOOKUP(U380,Tabelle!$B$4:$Q$6,16,FALSE)))","v":""},null,null,null,null,null,null,null,{"$f":"IF(B380=\"\",0,IF(B380=B379,COUNTIF(B$9:B379,B380)+1,1))","v":368},0,0]
["373","-1900","-1900-369",null,null,null,null,null,null,null,null,null,null,null,null,null,null,null,null,null,null,{"$f":"IF(M$1019=1,\"\",IF(U381=\"\",\"\",VLOOKUP(U381,Tabelle!$B$4:$O$6,14,FALSE)))","v":""},{"$f":"IF(M$1019=1,\"\",IF(U381=\"\",\"\",VLOOKUP(U381,Tabelle!$B$4:$Q$6,16,FALSE)))","v":""},null,null,null,null,null,null,null,{"$f":"IF(B381=\"\",0,IF(B381=B380,COUNTIF(B$9:B380,B381)+1,1))","v":369},0,0]
["374","-1900","-1900-370",null,null,null,null,null,null,null,null,null,null,null,null,null,null,null,null,null,null,{"$f":"IF(M$1019=1,\"\",IF(U382=\"\",\"\",VLOOKUP(U382,Tabelle!$B$4:$O$6,14,FALSE)))","v":""},{"$f":"IF(M$1019=1,\"\",IF(U382=\"\",\"\",VLOOKUP(U382,Tabelle!$B$4:$Q$6,16,FALSE)))","v":""},null,null,null,null,null,null,null,{"$f":"IF(B382=\"\",0,IF(B382=B381,COUNTIF(B$9:B381,B382)+1,1))","v":370},0,0]
["375","-1900","-1900-371",null,null,null,null,null,null,null,null,null,null,null,null,null,null,null,null,null,null,{"$f":"IF(M$1019=1,\"\",IF(U383=\"\",\"\",VLOOKUP(U383,Tabelle!$B$4:$O$6,14,FALSE)))","v":""},{"$f":"IF(M$1019=1,\"\",IF(U383=\"\",\"\",VLOOKUP(U383,Tabelle!$B$4:$Q$6,16,FALSE)))","v":""},null,null,null,null,null,null,null,{"$f":"IF(B383=\"\",0,IF(B383=B382,COUNTIF(B$9:B382,B383)+1,1))","v":371},0,0]
["376","-1900","-1900-372",null,null,null,null,null,null,null,null,null,null,null,null,null,null,null,null,null,null,{"$f":"IF(M$1019=1,\"\",IF(U384=\"\",\"\",VLOOKUP(U384,Tabelle!$B$4:$O$6,14,FALSE)))","v":""},{"$f":"IF(M$1019=1,\"\",IF(U384=\"\",\"\",VLOOKUP(U384,Tabelle!$B$4:$Q$6,16,FALSE)))","v":""},null,null,null,null,null,null,null,{"$f":"IF(B384=\"\",0,IF(B384=B383,COUNTIF(B$9:B383,B384)+1,1))","v":372},0,0]
["377","-1900","-1900-373",null,null,null,null,null,null,null,null,null,null,null,null,null,null,null,null,null,null,{"$f":"IF(M$1019=1,\"\",IF(U385=\"\",\"\",VLOOKUP(U385,Tabelle!$B$4:$O$6,14,FALSE)))","v":""},{"$f":"IF(M$1019=1,\"\",IF(U385=\"\",\"\",VLOOKUP(U385,Tabelle!$B$4:$Q$6,16,FALSE)))","v":""},null,null,null,null,null,null,null,{"$f":"IF(B385=\"\",0,IF(B385=B384,COUNTIF(B$9:B384,B385)+1,1))","v":373},0,0]
["378","-1900","-1900-374",null,null,null,null,null,null,null,null,null,null,null,null,null,null,null,null,null,null,{"$f":"IF(M$1019=1,\"\",IF(U386=\"\",\"\",VLOOKUP(U386,Tabelle!$B$4:$O$6,14,FALSE)))","v":""},{"$f":"IF(M$1019=1,\"\",IF(U386=\"\",\"\",VLOOKUP(U386,Tabelle!$B$4:$Q$6,16,FALSE)))","v":""},null,null,null,null,null,null,null,{"$f":"IF(B386=\"\",0,IF(B386=B385,COUNTIF(B$9:B385,B386)+1,1))","v":374},0,0]
["379","-1900","-1900-375",null,null,null,null,null,null,null,null,null,null,null,null,null,null,null,null,null,null,{"$f":"IF(M$1019=1,\"\",IF(U387=\"\",\"\",VLOOKUP(U387,Tabelle!$B$4:$O$6,14,FALSE)))","v":""},{"$f":"IF(M$1019=1,\"\",IF(U387=\"\",\"\",VLOOKUP(U387,Tabelle!$B$4:$Q$6,16,FALSE)))","v":""},null,null,null,null,null,null,null,{"$f":"IF(B387=\"\",0,IF(B387=B386,COUNTIF(B$9:B386,B387)+1,1))","v":375},0,0]
["380","-1900","-1900-376",null,null,null,null,null,null,null,null,null,null,null,null,null,null,null,null,null,null,{"$f":"IF(M$1019=1,\"\",IF(U388=\"\",\"\",VLOOKUP(U388,Tabelle!$B$4:$O$6,14,FALSE)))","v":""},{"$f":"IF(M$1019=1,\"\",IF(U388=\"\",\"\",VLOOKUP(U388,Tabelle!$B$4:$Q$6,16,FALSE)))","v":""},null,null,null,null,null,null,null,{"$f":"IF(B388=\"\",0,IF(B388=B387,COUNTIF(B$9:B387,B388)+1,1))","v":376},0,0]
["381","-1900","-1900-377",null,null,null,null,null,null,null,null,null,null,null,null,null,null,null,null,null,null,{"$f":"IF(M$1019=1,\"\",IF(U389=\"\",\"\",VLOOKUP(U389,Tabelle!$B$4:$O$6,14,FALSE)))","v":""},{"$f":"IF(M$1019=1,\"\",IF(U389=\"\",\"\",VLOOKUP(U389,Tabelle!$B$4:$Q$6,16,FALSE)))","v":""},null,null,null,null,null,null,null,{"$f":"IF(B389=\"\",0,IF(B389=B388,COUNTIF(B$9:B388,B389)+1,1))","v":377},0,0]
["382","-1900","-1900-378",null,null,null,null,null,null,null,null,null,null,null,null,null,null,null,null,null,null,{"$f":"IF(M$1019=1,\"\",IF(U390=\"\",\"\",VLOOKUP(U390,Tabelle!$B$4:$O$6,14,FALSE)))","v":""},{"$f":"IF(M$1019=1,\"\",IF(U390=\"\",\"\",VLOOKUP(U390,Tabelle!$B$4:$Q$6,16,FALSE)))","v":""},null,null,null,null,null,null,null,{"$f":"IF(B390=\"\",0,IF(B390=B389,COUNTIF(B$9:B389,B390)+1,1))","v":378},0,0]
["383","-1900","-1900-379",null,null,null,null,null,null,null,null,null,null,null,null,null,null,null,null,null,null,{"$f":"IF(M$1019=1,\"\",IF(U391=\"\",\"\",VLOOKUP(U391,Tabelle!$B$4:$O$6,14,FALSE)))","v":""},{"$f":"IF(M$1019=1,\"\",IF(U391=\"\",\"\",VLOOKUP(U391,Tabelle!$B$4:$Q$6,16,FALSE)))","v":""},null,null,null,null,null,null,null,{"$f":"IF(B391=\"\",0,IF(B391=B390,COUNTIF(B$9:B390,B391)+1,1))","v":379},0,0]
["384","-1900","-1900-380",null,null,null,null,null,null,null,null,null,null,null,null,null,null,null,null,null,null,{"$f":"IF(M$1019=1,\"\",IF(U392=\"\",\"\",VLOOKUP(U392,Tabelle!$B$4:$O$6,14,FALSE)))","v":""},{"$f":"IF(M$1019=1,\"\",IF(U392=\"\",\"\",VLOOKUP(U392,Tabelle!$B$4:$Q$6,16,FALSE)))","v":""},null,null,null,null,null,null,null,{"$f":"IF(B392=\"\",0,IF(B392=B391,COUNTIF(B$9:B391,B392)+1,1))","v":380},0,0]
["385","-1900","-1900-381",null,null,null,null,null,null,null,null,null,null,null,null,null,null,null,null,null,null,{"$f":"IF(M$1019=1,\"\",IF(U393=\"\",\"\",VLOOKUP(U393,Tabelle!$B$4:$O$6,14,FALSE)))","v":""},{"$f":"IF(M$1019=1,\"\",IF(U393=\"\",\"\",VLOOKUP(U393,Tabelle!$B$4:$Q$6,16,FALSE)))","v":""},null,null,null,null,null,null,null,{"$f":"IF(B393=\"\",0,IF(B393=B392,COUNTIF(B$9:B392,B393)+1,1))","v":381},0,0]
["386",{"$f":"IF(AG394=$AG$1013,0,IF(M$1019=1,0,D394&\"-\"&YEAR(E394)))","v":"-1900"},"-1900-382",null,null,null,null,null,null,null,null,null,null,null,null,null,null,null,null,null,null,{"$f":"IF(M$1019=1,\"\",IF(U394=\"\",\"\",VLOOKUP(U394,Tabelle!$B$4:$O$6,14,FALSE)))","v":""},{"$f":"IF(M$1019=1,\"\",IF(U394=\"\",\"\",VLOOKUP(U394,Tabelle!$B$4:$Q$6,16,FALSE)))","v":""},null,null,null,null,null,null,null,{"$f":"IF(B394=\"\",0,IF(B394=B393,COUNTIF(B$9:B393,B394)+1,1))","v":382},0,{"$f":"IF(E394>0,IF(OR(MONTH(E394)<$L$1030,MONTH(E394)>$L$1031),AG$1013,0),0)","v":0}]
["387","-1900","-1900-383",null,null,null,null,null,null,null,null,null,null,null,null,null,null,null,null,null,null,{"$f":"IF(M$1019=1,\"\",IF(U395=\"\",\"\",VLOOKUP(U395,Tabelle!$B$4:$O$6,14,FALSE)))","v":""},{"$f":"IF(M$1019=1,\"\",IF(U395=\"\",\"\",VLOOKUP(U395,Tabelle!$B$4:$Q$6,16,FALSE)))","v":""},null,null,null,null,null,null,null,{"$f":"IF(B395=\"\",0,IF(B395=B394,COUNTIF(B$9:B394,B395)+1,1))","v":383},0,0]
["388","-1900","-1900-384",null,null,null,null,null,null,null,null,null,null,null,null,null,null,null,null,null,null,{"$f":"IF(M$1019=1,\"\",IF(U396=\"\",\"\",VLOOKUP(U396,Tabelle!$B$4:$O$6,14,FALSE)))","v":""},{"$f":"IF(M$1019=1,\"\",IF(U396=\"\",\"\",VLOOKUP(U396,Tabelle!$B$4:$Q$6,16,FALSE)))","v":""},null,null,null,null,null,null,null,{"$f":"IF(B396=\"\",0,IF(B396=B395,COUNTIF(B$9:B395,B396)+1,1))","v":384},0,0]
["389","-1900","-1900-385",null,null,null,null,null,null,null,null,null,null,null,null,null,null,null,null,null,null,{"$f":"IF(M$1019=1,\"\",IF(U397=\"\",\"\",VLOOKUP(U397,Tabelle!$B$4:$O$6,14,FALSE)))","v":""},{"$f":"IF(M$1019=1,\"\",IF(U397=\"\",\"\",VLOOKUP(U397,Tabelle!$B$4:$Q$6,16,FALSE)))","v":""},null,null,null,null,null,null,null,{"$f":"IF(B397=\"\",0,IF(B397=B396,COUNTIF(B$9:B396,B397)+1,1))","v":385},0,0]
["390","-1900","-1900-386",null,null,null,null,null,null,null,null,null,null,null,null,null,null,null,null,null,null,{"$f":"IF(M$1019=1,\"\",IF(U398=\"\",\"\",VLOOKUP(U398,Tabelle!$B$4:$O$6,14,FALSE)))","v":""},{"$f":"IF(M$1019=1,\"\",IF(U398=\"\",\"\",VLOOKUP(U398,Tabelle!$B$4:$Q$6,16,FALSE)))","v":""},null,null,null,null,null,null,null,{"$f":"IF(B398=\"\",0,IF(B398=B397,COUNTIF(B$9:B397,B398)+1,1))","v":386},0,0]
["391","-1900","-1900-387",null,null,null,null,null,null,null,null,null,null,null,null,null,null,null,null,null,null,{"$f":"IF(M$1019=1,\"\",IF(U399=\"\",\"\",VLOOKUP(U399,Tabelle!$B$4:$O$6,14,FALSE)))","v":""},{"$f":"IF(M$1019=1,\"\",IF(U399=\"\",\"\",VLOOKUP(U399,Tabelle!$B$4:$Q$6,16,FALSE)))","v":""},null,null,null,null,null,null,null,{"$f":"IF(B399=\"\",0,IF(B399=B398,COUNTIF(B$9:B398,B399)+1,1))","v":387},0,0]
["392","-1900","-1900-388",null,null,null,null,null,null,null,null,null,null,null,null,null,null,null,null,null,null,{"$f":"IF(M$1019=1,\"\",IF(U400=\"\",\"\",VLOOKUP(U400,Tabelle!$B$4:$O$6,14,FALSE)))","v":""},{"$f":"IF(M$1019=1,\"\",IF(U400=\"\",\"\",VLOOKUP(U400,Tabelle!$B$4:$Q$6,16,FALSE)))","v":""},null,null,null,null,null,null,null,{"$f":"IF(B400=\"\",0,IF(B400=B399,COUNTIF(B$9:B399,B400)+1,1))","v":388},0,0]
["393","-1900","-1900-389",null,null,null,null,null,null,null,null,null,null,null,null,null,null,null,null,null,null,{"$f":"IF(M$1019=1,\"\",IF(U401=\"\",\"\",VLOOKUP(U401,Tabelle!$B$4:$O$6,14,FALSE)))","v":""},{"$f":"IF(M$1019=1,\"\",IF(U401=\"\",\"\",VLOOKUP(U401,Tabelle!$B$4:$Q$6,16,FALSE)))","v":""},null,null,null,null,null,null,null,{"$f":"IF(B401=\"\",0,IF(B401=B400,COUNTIF(B$9:B400,B401)+1,1))","v":389},0,0]
["394","-1900","-1900-390",null,null,null,null,null,null,null,null,null,null,null,null,null,null,null,null,null,null,{"$f":"IF(M$1019=1,\"\",IF(U402=\"\",\"\",VLOOKUP(U402,Tabelle!$B$4:$O$6,14,FALSE)))","v":""},{"$f":"IF(M$1019=1,\"\",IF(U402=\"\",\"\",VLOOKUP(U402,Tabelle!$B$4:$Q$6,16,FALSE)))","v":""},null,null,null,null,null,null,null,{"$f":"IF(B402=\"\",0,IF(B402=B401,COUNTIF(B$9:B401,B402)+1,1))","v":390},0,0]
["395","-1900","-1900-391",null,null,null,null,null,null,null,null,null,null,null,null,null,null,null,null,null,null,{"$f":"IF(M$1019=1,\"\",IF(U403=\"\",\"\",VLOOKUP(U403,Tabelle!$B$4:$O$6,14,FALSE)))","v":""},{"$f":"IF(M$1019=1,\"\",IF(U403=\"\",\"\",VLOOKUP(U403,Tabelle!$B$4:$Q$6,16,FALSE)))","v":""},null,null,null,null,null,null,null,{"$f":"IF(B403=\"\",0,IF(B403=B402,COUNTIF(B$9:B402,B403)+1,1))","v":391},0,0]
["396","-1900","-1900-392",null,null,null,null,null,null,null,null,null,null,null,null,null,null,null,null,null,null,{"$f":"IF(M$1019=1,\"\",IF(U404=\"\",\"\",VLOOKUP(U404,Tabelle!$B$4:$O$6,14,FALSE)))","v":""},{"$f":"IF(M$1019=1,\"\",IF(U404=\"\",\"\",VLOOKUP(U404,Tabelle!$B$4:$Q$6,16,FALSE)))","v":""},null,null,null,null,null,null,null,{"$f":"IF(B404=\"\",0,IF(B404=B403,COUNTIF(B$9:B403,B404)+1,1))","v":392},{"$f":"IF(OR(D404=\"\",M$1019=1),0,IF(AE404=8,1,0))","v":0},0]
["397","-1900","-1900-393",null,null,null,null,null,null,null,null,null,null,null,null,null,null,null,null,null,null,{"$f":"IF(M$1019=1,\"\",IF(U405=\"\",\"\",VLOOKUP(U405,Tabelle!$B$4:$O$6,14,FALSE)))","v":""},{"$f":"IF(M$1019=1,\"\",IF(U405=\"\",\"\",VLOOKUP(U405,Tabelle!$B$4:$Q$6,16,FALSE)))","v":""},null,null,null,null,null,null,null,{"$f":"IF(B405=\"\",0,IF(B405=B404,COUNTIF(B$9:B404,B405)+1,1))","v":393},0,0]
["398","-1900","-1900-394",null,null,null,null,null,null,null,null,null,null,null,null,null,null,null,null,null,null,{"$f":"IF(M$1019=1,\"\",IF(U406=\"\",\"\",VLOOKUP(U406,Tabelle!$B$4:$O$6,14,FALSE)))","v":""},{"$f":"IF(M$1019=1,\"\",IF(U406=\"\",\"\",VLOOKUP(U406,Tabelle!$B$4:$Q$6,16,FALSE)))","v":""},null,null,null,null,null,null,null,{"$f":"IF(B406=\"\",0,IF(B406=B405,COUNTIF(B$9:B405,B406)+1,1))","v":394},0,0]
["399","-1900","-1900-395",null,null,null,null,null,null,null,null,null,null,null,null,null,null,null,null,null,null,{"$f":"IF(M$1019=1,\"\",IF(U407=\"\",\"\",VLOOKUP(U407,Tabelle!$B$4:$O$6,14,FALSE)))","v":""},{"$f":"IF(M$1019=1,\"\",IF(U407=\"\",\"\",VLOOKUP(U407,Tabelle!$B$4:$Q$6,16,FALSE)))","v":""},null,null,null,null,null,null,null,{"$f":"IF(B407=\"\",0,IF(B407=B406,COUNTIF(B$9:B406,B407)+1,1))","v":395},0,0]
["400","-1900","-1900-396",null,null,null,null,null,null,null,null,null,null,null,null,null,null,null,null,null,null,{"$f":"IF(M$1019=1,\"\",IF(U408=\"\",\"\",VLOOKUP(U408,Tabelle!$B$4:$O$6,14,FALSE)))","v":""},{"$f":"IF(M$1019=1,\"\",IF(U408=\"\",\"\",VLOOKUP(U408,Tabelle!$B$4:$Q$6,16,FALSE)))","v":""},null,null,null,null,null,null,null,{"$f":"IF(B408=\"\",0,IF(B408=B407,COUNTIF(B$9:B407,B408)+1,1))","v":396},0,0]
["401","-1900","-1900-397",null,null,null,null,null,null,null,null,null,null,null,null,null,null,null,null,null,null,{"$f":"IF(M$1019=1,\"\",IF(U409=\"\",\"\",VLOOKUP(U409,Tabelle!$B$4:$O$6,14,FALSE)))","v":""},{"$f":"IF(M$1019=1,\"\",IF(U409=\"\",\"\",VLOOKUP(U409,Tabelle!$B$4:$Q$6,16,FALSE)))","v":""},null,null,null,null,null,null,null,{"$f":"IF(B409=\"\",0,IF(B409=B408,COUNTIF(B$9:B408,B409)+1,1))","v":397},0,0]
["402","-1900","-1900-398",null,null,null,null,null,null,null,null,null,null,null,null,null,null,null,null,null,null,{"$f":"IF(M$1019=1,\"\",IF(U410=\"\",\"\",VLOOKUP(U410,Tabelle!$B$4:$O$6,14,FALSE)))","v":""},{"$f":"IF(M$1019=1,\"\",IF(U410=\"\",\"\",VLOOKUP(U410,Tabelle!$B$4:$Q$6,16,FALSE)))","v":""},null,null,null,null,null,null,null,{"$f":"IF(B410=\"\",0,IF(B410=B409,COUNTIF(B$9:B409,B410)+1,1))","v":398},0,0]
["403","-1900","-1900-399",null,null,null,null,null,null,null,null,null,null,null,null,null,null,null,null,null,null,{"$f":"IF(M$1019=1,\"\",IF(U411=\"\",\"\",VLOOKUP(U411,Tabelle!$B$4:$O$6,14,FALSE)))","v":""},{"$f":"IF(M$1019=1,\"\",IF(U411=\"\",\"\",VLOOKUP(U411,Tabelle!$B$4:$Q$6,16,FALSE)))","v":""},null,null,null,null,null,null,null,{"$f":"IF(B411=\"\",0,IF(B411=B410,COUNTIF(B$9:B410,B411)+1,1))","v":399},0,0]
["404","-1900","-1900-400",null,null,null,null,null,null,null,null,null,null,null,null,null,null,null,null,null,null,{"$f":"IF(M$1019=1,\"\",IF(U412=\"\",\"\",VLOOKUP(U412,Tabelle!$B$4:$O$6,14,FALSE)))","v":""},{"$f":"IF(M$1019=1,\"\",IF(U412=\"\",\"\",VLOOKUP(U412,Tabelle!$B$4:$Q$6,16,FALSE)))","v":""},null,null,null,null,null,null,null,{"$f":"IF(B412=\"\",0,IF(B412=B411,COUNTIF(B$9:B411,B412)+1,1))","v":400},0,0]
["405","-1900","-1900-401",null,null,null,null,null,null,null,null,null,null,null,null,null,null,null,null,null,null,{"$f":"IF(M$1019=1,\"\",IF(U413=\"\",\"\",VLOOKUP(U413,Tabelle!$B$4:$O$6,14,FALSE)))","v":""},{"$f":"IF(M$1019=1,\"\",IF(U413=\"\",\"\",VLOOKUP(U413,Tabelle!$B$4:$Q$6,16,FALSE)))","v":""},null,null,null,null,null,null,null,{"$f":"IF(B413=\"\",0,IF(B413=B412,COUNTIF(B$9:B412,B413)+1,1))","v":401},0,0]
["406","-1900","-1900-402",null,null,null,null,null,null,null,null,null,null,null,null,null,null,null,null,null,null,{"$f":"IF(M$1019=1,\"\",IF(U414=\"\",\"\",VLOOKUP(U414,Tabelle!$B$4:$O$6,14,FALSE)))","v":""},{"$f":"IF(M$1019=1,\"\",IF(U414=\"\",\"\",VLOOKUP(U414,Tabelle!$B$4:$Q$6,16,FALSE)))","v":""},null,null,null,null,null,null,null,{"$f":"IF(B414=\"\",0,IF(B414=B413,COUNTIF(B$9:B413,B414)+1,1))","v":402},0,0]
["407","-1900","-1900-403",null,null,null,null,null,null,null,null,null,null,null,null,null,null,null,null,null,null,{"$f":"IF(M$1019=1,\"\",IF(U415=\"\",\"\",VLOOKUP(U415,Tabelle!$B$4:$O$6,14,FALSE)))","v":""},{"$f":"IF(M$1019=1,\"\",IF(U415=\"\",\"\",VLOOKUP(U415,Tabelle!$B$4:$Q$6,16,FALSE)))","v":""},null,null,null,null,null,null,null,{"$f":"IF(B415=\"\",0,IF(B415=B414,COUNTIF(B$9:B414,B415)+1,1))","v":403},0,0]
["408","-1900","-1900-404",null,null,null,null,null,null,null,null,null,null,null,null,null,null,null,null,null,null,{"$f":"IF(M$1019=1,\"\",IF(U416=\"\",\"\",VLOOKUP(U416,Tabelle!$B$4:$O$6,14,FALSE)))","v":""},{"$f":"IF(M$1019=1,\"\",IF(U416=\"\",\"\",VLOOKUP(U416,Tabelle!$B$4:$Q$6,16,FALSE)))","v":""},null,null,null,null,null,null,null,{"$f":"IF(B416=\"\",0,IF(B416=B415,COUNTIF(B$9:B415,B416)+1,1))","v":404},0,0]
["409","-1900","-1900-405",null,null,null,null,null,null,null,null,null,null,null,null,null,null,null,null,null,null,{"$f":"IF(M$1019=1,\"\",IF(U417=\"\",\"\",VLOOKUP(U417,Tabelle!$B$4:$O$6,14,FALSE)))","v":""},{"$f":"IF(M$1019=1,\"\",IF(U417=\"\",\"\",VLOOKUP(U417,Tabelle!$B$4:$Q$6,16,FALSE)))","v":""},null,null,null,null,null,null,null,{"$f":"IF(B417=\"\",0,IF(B417=B416,COUNTIF(B$9:B416,B417)+1,1))","v":405},0,0]
["410","-1900","-1900-406",null,null,null,null,null,null,null,null,null,null,null,null,null,null,null,null,null,null,{"$f":"IF(M$1019=1,\"\",IF(U418=\"\",\"\",VLOOKUP(U418,Tabelle!$B$4:$O$6,14,FALSE)))","v":""},{"$f":"IF(M$1019=1,\"\",IF(U418=\"\",\"\",VLOOKUP(U418,Tabelle!$B$4:$Q$6,16,FALSE)))","v":""},null,null,null,null,null,null,null,{"$f":"IF(B418=\"\",0,IF(B418=B417,COUNTIF(B$9:B417,B418)+1,1))","v":406},0,0]
["411","-1900","-1900-407",null,null,null,null,null,null,null,null,null,null,null,null,null,null,null,null,null,null,{"$f":"IF(M$1019=1,\"\",IF(U419=\"\",\"\",VLOOKUP(U419,Tabelle!$B$4:$O$6,14,FALSE)))","v":""},{"$f":"IF(M$1019=1,\"\",IF(U419=\"\",\"\",VLOOKUP(U419,Tabelle!$B$4:$Q$6,16,FALSE)))","v":""},null,null,null,null,null,null,null,{"$f":"IF(B419=\"\",0,IF(B419=B418,COUNTIF(B$9:B418,B419)+1,1))","v":407},0,0]
["412","-1900","-1900-408",null,null,null,null,null,null,null,null,null,null,null,null,null,null,null,null,null,null,{"$f":"IF(M$1019=1,\"\",IF(U420=\"\",\"\",VLOOKUP(U420,Tabelle!$B$4:$O$6,14,FALSE)))","v":""},{"$f":"IF(M$1019=1,\"\",IF(U420=\"\",\"\",VLOOKUP(U420,Tabelle!$B$4:$Q$6,16,FALSE)))","v":""},null,null,null,null,null,null,null,{"$f":"IF(B420=\"\",0,IF(B420=B419,COUNTIF(B$9:B419,B420)+1,1))","v":408},0,0]
["413","-1900","-1900-409",null,null,null,null,null,null,null,null,null,null,null,null,null,null,null,null,null,null,{"$f":"IF(M$1019=1,\"\",IF(U421=\"\",\"\",VLOOKUP(U421,Tabelle!$B$4:$O$6,14,FALSE)))","v":""},{"$f":"IF(M$1019=1,\"\",IF(U421=\"\",\"\",VLOOKUP(U421,Tabelle!$B$4:$Q$6,16,FALSE)))","v":""},null,null,null,null,null,null,null,{"$f":"IF(B421=\"\",0,IF(B421=B420,COUNTIF(B$9:B420,B421)+1,1))","v":409},0,0]
["414","-1900","-1900-410",null,null,null,null,null,null,null,null,null,null,null,null,null,null,null,null,null,null,{"$f":"IF(M$1019=1,\"\",IF(U422=\"\",\"\",VLOOKUP(U422,Tabelle!$B$4:$O$6,14,FALSE)))","v":""},{"$f":"IF(M$1019=1,\"\",IF(U422=\"\",\"\",VLOOKUP(U422,Tabelle!$B$4:$Q$6,16,FALSE)))","v":""},null,null,null,null,null,null,null,{"$f":"IF(B422=\"\",0,IF(B422=B421,COUNTIF(B$9:B421,B422)+1,1))","v":410},0,0]
["415","-1900","-1900-411",null,null,null,null,null,null,null,null,null,null,null,null,null,null,null,null,null,null,{"$f":"IF(M$1019=1,\"\",IF(U423=\"\",\"\",VLOOKUP(U423,Tabelle!$B$4:$O$6,14,FALSE)))","v":""},{"$f":"IF(M$1019=1,\"\",IF(U423=\"\",\"\",VLOOKUP(U423,Tabelle!$B$4:$Q$6,16,FALSE)))","v":""},null,null,null,null,null,null,null,{"$f":"IF(B423=\"\",0,IF(B423=B422,COUNTIF(B$9:B422,B423)+1,1))","v":411},0,0]
["416","-1900","-1900-412",null,null,null,null,null,null,null,null,null,null,null,null,null,null,null,null,null,null,{"$f":"IF(M$1019=1,\"\",IF(U424=\"\",\"\",VLOOKUP(U424,Tabelle!$B$4:$O$6,14,FALSE)))","v":""},{"$f":"IF(M$1019=1,\"\",IF(U424=\"\",\"\",VLOOKUP(U424,Tabelle!$B$4:$Q$6,16,FALSE)))","v":""},null,null,null,null,null,null,null,{"$f":"IF(B424=\"\",0,IF(B424=B423,COUNTIF(B$9:B423,B424)+1,1))","v":412},0,0]
["417","-1900","-1900-413",null,null,null,null,null,null,null,null,null,null,null,null,null,null,null,null,null,null,{"$f":"IF(M$1019=1,\"\",IF(U425=\"\",\"\",VLOOKUP(U425,Tabelle!$B$4:$O$6,14,FALSE)))","v":""},{"$f":"IF(M$1019=1,\"\",IF(U425=\"\",\"\",VLOOKUP(U425,Tabelle!$B$4:$Q$6,16,FALSE)))","v":""},null,null,null,null,null,null,null,{"$f":"IF(B425=\"\",0,IF(B425=B424,COUNTIF(B$9:B424,B425)+1,1))","v":413},0,0]
["418","-1900","-1900-414",null,null,null,null,null,null,null,null,null,null,null,null,null,null,null,null,null,null,{"$f":"IF(M$1019=1,\"\",IF(U426=\"\",\"\",VLOOKUP(U426,Tabelle!$B$4:$O$6,14,FALSE)))","v":""},{"$f":"IF(M$1019=1,\"\",IF(U426=\"\",\"\",VLOOKUP(U426,Tabelle!$B$4:$Q$6,16,FALSE)))","v":""},null,null,null,null,null,null,null,{"$f":"IF(B426=\"\",0,IF(B426=B425,COUNTIF(B$9:B425,B426)+1,1))","v":414},0,0]
["419","-1900","-1900-415",null,null,null,null,null,null,null,null,null,null,null,null,null,null,null,null,null,null,{"$f":"IF(M$1019=1,\"\",IF(U427=\"\",\"\",VLOOKUP(U427,Tabelle!$B$4:$O$6,14,FALSE)))","v":""},{"$f":"IF(M$1019=1,\"\",IF(U427=\"\",\"\",VLOOKUP(U427,Tabelle!$B$4:$Q$6,16,FALSE)))","v":""},null,null,null,null,null,null,null,{"$f":"IF(B427=\"\",0,IF(B427=B426,COUNTIF(B$9:B426,B427)+1,1))","v":415},0,0]
["420","-1900","-1900-416",null,null,null,null,null,null,null,null,null,null,null,null,null,null,null,null,null,null,{"$f":"IF(M$1019=1,\"\",IF(U428=\"\",\"\",VLOOKUP(U428,Tabelle!$B$4:$O$6,14,FALSE)))","v":""},{"$f":"IF(M$1019=1,\"\",IF(U428=\"\",\"\",VLOOKUP(U428,Tabelle!$B$4:$Q$6,16,FALSE)))","v":""},null,null,null,null,null,null,null,{"$f":"IF(B428=\"\",0,IF(B428=B427,COUNTIF(B$9:B427,B428)+1,1))","v":416},0,0]
["421","-1900","-1900-417",null,null,null,null,null,null,null,null,null,null,null,null,null,null,null,null,null,null,{"$f":"IF(M$1019=1,\"\",IF(U429=\"\",\"\",VLOOKUP(U429,Tabelle!$B$4:$O$6,14,FALSE)))","v":""},{"$f":"IF(M$1019=1,\"\",IF(U429=\"\",\"\",VLOOKUP(U429,Tabelle!$B$4:$Q$6,16,FALSE)))","v":""},null,null,null,null,null,null,null,{"$f":"IF(B429=\"\",0,IF(B429=B428,COUNTIF(B$9:B428,B429)+1,1))","v":417},0,0]
["422","-1900","-1900-418",null,null,null,null,null,null,null,null,null,null,null,null,null,null,null,null,null,null,{"$f":"IF(M$1019=1,\"\",IF(U430=\"\",\"\",VLOOKUP(U430,Tabelle!$B$4:$O$6,14,FALSE)))","v":""},{"$f":"IF(M$1019=1,\"\",IF(U430=\"\",\"\",VLOOKUP(U430,Tabelle!$B$4:$Q$6,16,FALSE)))","v":""},null,null,null,null,null,null,null,{"$f":"IF(B430=\"\",0,IF(B430=B429,COUNTIF(B$9:B429,B430)+1,1))","v":418},0,0]
["423","-1900","-1900-419",null,null,null,null,null,null,null,null,null,null,null,null,null,null,null,null,null,null,{"$f":"IF(M$1019=1,\"\",IF(U431=\"\",\"\",VLOOKUP(U431,Tabelle!$B$4:$O$6,14,FALSE)))","v":""},{"$f":"IF(M$1019=1,\"\",IF(U431=\"\",\"\",VLOOKUP(U431,Tabelle!$B$4:$Q$6,16,FALSE)))","v":""},null,null,null,null,null,null,null,{"$f":"IF(B431=\"\",0,IF(B431=B430,COUNTIF(B$9:B430,B431)+1,1))","v":419},0,0]
["424","-1900","-1900-420",null,null,null,null,null,null,null,null,null,null,null,null,null,null,null,null,null,null,{"$f":"IF(M$1019=1,\"\",IF(U432=\"\",\"\",VLOOKUP(U432,Tabelle!$B$4:$O$6,14,FALSE)))","v":""},{"$f":"IF(M$1019=1,\"\",IF(U432=\"\",\"\",VLOOKUP(U432,Tabelle!$B$4:$Q$6,16,FALSE)))","v":""},null,null,null,null,null,null,null,{"$f":"IF(B432=\"\",0,IF(B432=B431,COUNTIF(B$9:B431,B432)+1,1))","v":420},0,0]
["425","-1900","-1900-421",null,null,null,null,null,null,null,null,null,null,null,null,null,null,null,null,null,null,{"$f":"IF(M$1019=1,\"\",IF(U433=\"\",\"\",VLOOKUP(U433,Tabelle!$B$4:$O$6,14,FALSE)))","v":""},{"$f":"IF(M$1019=1,\"\",IF(U433=\"\",\"\",VLOOKUP(U433,Tabelle!$B$4:$Q$6,16,FALSE)))","v":""},null,null,null,null,null,null,null,{"$f":"IF(B433=\"\",0,IF(B433=B432,COUNTIF(B$9:B432,B433)+1,1))","v":421},0,0]
["426","-1900","-1900-422",null,null,null,null,null,null,null,null,null,null,null,null,null,null,null,null,null,null,{"$f":"IF(M$1019=1,\"\",IF(U434=\"\",\"\",VLOOKUP(U434,Tabelle!$B$4:$O$6,14,FALSE)))","v":""},{"$f":"IF(M$1019=1,\"\",IF(U434=\"\",\"\",VLOOKUP(U434,Tabelle!$B$4:$Q$6,16,FALSE)))","v":""},null,null,null,null,null,null,null,{"$f":"IF(B434=\"\",0,IF(B434=B433,COUNTIF(B$9:B433,B434)+1,1))","v":422},0,0]
["427","-1900",{"$f":"IF(M$1019=1,0,B435&\"-\"&AE435)","v":"-1900-423"},null,null,null,null,null,null,null,null,null,null,null,null,null,null,null,null,null,null,{"$f":"IF(M$1019=1,\"\",IF(U435=\"\",\"\",VLOOKUP(U435,Tabelle!$B$4:$O$6,14,FALSE)))","v":""},{"$f":"IF(M$1019=1,\"\",IF(U435=\"\",\"\",VLOOKUP(U435,Tabelle!$B$4:$Q$6,16,FALSE)))","v":""},null,null,null,null,null,null,null,{"$f":"IF(B435=\"\",0,IF(B435=B434,COUNTIF(B$9:B434,B435)+1,1))","v":423},0,0]
["428","-1900","-1900-424",null,null,null,null,null,null,null,null,null,null,null,null,null,null,null,null,null,null,{"$f":"IF(M$1019=1,\"\",IF(U436=\"\",\"\",VLOOKUP(U436,Tabelle!$B$4:$O$6,14,FALSE)))","v":""},{"$f":"IF(M$1019=1,\"\",IF(U436=\"\",\"\",VLOOKUP(U436,Tabelle!$B$4:$Q$6,16,FALSE)))","v":""},null,null,null,null,null,null,null,{"$f":"IF(B436=\"\",0,IF(B436=B435,COUNTIF(B$9:B435,B436)+1,1))","v":424},0,0]
["429","-1900","-1900-425",null,null,null,null,null,null,null,null,null,null,null,null,null,null,null,null,null,null,{"$f":"IF(M$1019=1,\"\",IF(U437=\"\",\"\",VLOOKUP(U437,Tabelle!$B$4:$O$6,14,FALSE)))","v":""},{"$f":"IF(M$1019=1,\"\",IF(U437=\"\",\"\",VLOOKUP(U437,Tabelle!$B$4:$Q$6,16,FALSE)))","v":""},null,null,null,null,null,null,null,{"$f":"IF(B437=\"\",0,IF(B437=B436,COUNTIF(B$9:B436,B437)+1,1))","v":425},0,0]
["430","-1900","-1900-426",null,null,null,null,null,null,null,null,null,null,null,null,null,null,null,null,null,null,{"$f":"IF(M$1019=1,\"\",IF(U438=\"\",\"\",VLOOKUP(U438,Tabelle!$B$4:$O$6,14,FALSE)))","v":""},{"$f":"IF(M$1019=1,\"\",IF(U438=\"\",\"\",VLOOKUP(U438,Tabelle!$B$4:$Q$6,16,FALSE)))","v":""},null,null,null,null,null,null,null,{"$f":"IF(B438=\"\",0,IF(B438=B437,COUNTIF(B$9:B437,B438)+1,1))","v":426},0,0]
["431","-1900","-1900-427",null,null,null,null,null,null,null,null,null,null,null,null,null,null,null,null,null,null,{"$f":"IF(M$1019=1,\"\",IF(U439=\"\",\"\",VLOOKUP(U439,Tabelle!$B$4:$O$6,14,FALSE)))","v":""},{"$f":"IF(M$1019=1,\"\",IF(U439=\"\",\"\",VLOOKUP(U439,Tabelle!$B$4:$Q$6,16,FALSE)))","v":""},null,null,null,null,null,null,null,{"$f":"IF(B439=\"\",0,IF(B439=B438,COUNTIF(B$9:B438,B439)+1,1))","v":427},0,0]
["432","-1900","-1900-428",null,null,null,null,null,null,null,null,null,null,null,null,null,null,null,null,null,null,{"$f":"IF(M$1019=1,\"\",IF(U440=\"\",\"\",VLOOKUP(U440,Tabelle!$B$4:$O$6,14,FALSE)))","v":""},{"$f":"IF(M$1019=1,\"\",IF(U440=\"\",\"\",VLOOKUP(U440,Tabelle!$B$4:$Q$6,16,FALSE)))","v":""},null,null,null,null,null,null,null,{"$f":"IF(B440=\"\",0,IF(B440=B439,COUNTIF(B$9:B439,B440)+1,1))","v":428},0,0]
["433","-1900","-1900-429",null,null,null,null,null,null,null,null,null,null,null,null,null,null,null,null,null,null,{"$f":"IF(M$1019=1,\"\",IF(U441=\"\",\"\",VLOOKUP(U441,Tabelle!$B$4:$O$6,14,FALSE)))","v":""},{"$f":"IF(M$1019=1,\"\",IF(U441=\"\",\"\",VLOOKUP(U441,Tabelle!$B$4:$Q$6,16,FALSE)))","v":""},null,null,null,null,null,null,null,{"$f":"IF(B441=\"\",0,IF(B441=B440,COUNTIF(B$9:B440,B441)+1,1))","v":429},0,0]
["434","-1900","-1900-430",null,null,null,null,null,null,null,null,null,null,null,null,null,null,null,null,null,null,{"$f":"IF(M$1019=1,\"\",IF(U442=\"\",\"\",VLOOKUP(U442,Tabelle!$B$4:$O$6,14,FALSE)))","v":""},{"$f":"IF(M$1019=1,\"\",IF(U442=\"\",\"\",VLOOKUP(U442,Tabelle!$B$4:$Q$6,16,FALSE)))","v":""},null,null,null,null,null,null,null,{"$f":"IF(B442=\"\",0,IF(B442=B441,COUNTIF(B$9:B441,B442)+1,1))","v":430},0,0]
["435","-1900","-1900-431",null,null,null,null,null,null,null,null,null,null,null,null,null,null,null,null,null,null,{"$f":"IF(M$1019=1,\"\",IF(U443=\"\",\"\",VLOOKUP(U443,Tabelle!$B$4:$O$6,14,FALSE)))","v":""},{"$f":"IF(M$1019=1,\"\",IF(U443=\"\",\"\",VLOOKUP(U443,Tabelle!$B$4:$Q$6,16,FALSE)))","v":""},null,null,null,null,null,null,null,{"$f":"IF(B443=\"\",0,IF(B443=B442,COUNTIF(B$9:B442,B443)+1,1))","v":431},0,0]
["436","-1900","-1900-432",null,null,null,null,null,null,null,null,null,null,null,null,null,null,null,null,null,null,{"$f":"IF(M$1019=1,\"\",IF(U444=\"\",\"\",VLOOKUP(U444,Tabelle!$B$4:$O$6,14,FALSE)))","v":""},{"$f":"IF(M$1019=1,\"\",IF(U444=\"\",\"\",VLOOKUP(U444,Tabelle!$B$4:$Q$6,16,FALSE)))","v":""},null,null,null,null,null,null,null,{"$f":"IF(B444=\"\",0,IF(B444=B443,COUNTIF(B$9:B443,B444)+1,1))","v":432},0,0]
["437","-1900","-1900-433",null,null,null,null,null,null,null,null,null,null,null,null,null,null,null,null,null,null,{"$f":"IF(M$1019=1,\"\",IF(U445=\"\",\"\",VLOOKUP(U445,Tabelle!$B$4:$O$6,14,FALSE)))","v":""},{"$f":"IF(M$1019=1,\"\",IF(U445=\"\",\"\",VLOOKUP(U445,Tabelle!$B$4:$Q$6,16,FALSE)))","v":""},null,null,null,null,null,null,null,{"$f":"IF(B445=\"\",0,IF(B445=B444,COUNTIF(B$9:B444,B445)+1,1))","v":433},0,0]
["438","-1900","-1900-434",null,null,null,null,null,null,null,null,null,null,null,null,null,null,null,null,null,null,{"$f":"IF(M$1019=1,\"\",IF(U446=\"\",\"\",VLOOKUP(U446,Tabelle!$B$4:$O$6,14,FALSE)))","v":""},{"$f":"IF(M$1019=1,\"\",IF(U446=\"\",\"\",VLOOKUP(U446,Tabelle!$B$4:$Q$6,16,FALSE)))","v":""},null,null,null,null,null,null,null,{"$f":"IF(B446=\"\",0,IF(B446=B445,COUNTIF(B$9:B445,B446)+1,1))","v":434},0,0]
["439","-1900","-1900-435",null,null,null,null,null,null,null,null,null,null,null,null,null,null,null,null,null,null,{"$f":"IF(M$1019=1,\"\",IF(U447=\"\",\"\",VLOOKUP(U447,Tabelle!$B$4:$O$6,14,FALSE)))","v":""},{"$f":"IF(M$1019=1,\"\",IF(U447=\"\",\"\",VLOOKUP(U447,Tabelle!$B$4:$Q$6,16,FALSE)))","v":""},null,null,null,null,null,null,null,{"$f":"IF(B447=\"\",0,IF(B447=B446,COUNTIF(B$9:B446,B447)+1,1))","v":435},0,0]
["440","-1900","-1900-436",null,null,null,null,null,null,null,null,null,null,null,null,null,null,null,null,null,null,{"$f":"IF(M$1019=1,\"\",IF(U448=\"\",\"\",VLOOKUP(U448,Tabelle!$B$4:$O$6,14,FALSE)))","v":""},{"$f":"IF(M$1019=1,\"\",IF(U448=\"\",\"\",VLOOKUP(U448,Tabelle!$B$4:$Q$6,16,FALSE)))","v":""},null,null,null,null,null,null,null,{"$f":"IF(B448=\"\",0,IF(B448=B447,COUNTIF(B$9:B447,B448)+1,1))","v":436},0,0]
["441","-1900","-1900-437",null,null,null,null,null,null,null,null,null,null,null,null,null,null,null,null,null,null,{"$f":"IF(M$1019=1,\"\",IF(U449=\"\",\"\",VLOOKUP(U449,Tabelle!$B$4:$O$6,14,FALSE)))","v":""},{"$f":"IF(M$1019=1,\"\",IF(U449=\"\",\"\",VLOOKUP(U449,Tabelle!$B$4:$Q$6,16,FALSE)))","v":""},null,null,null,null,null,null,null,{"$f":"IF(B449=\"\",0,IF(B449=B448,COUNTIF(B$9:B448,B449)+1,1))","v":437},0,0]
["442","-1900","-1900-438",null,null,null,null,null,null,null,null,null,null,null,null,null,null,null,null,null,null,{"$f":"IF(M$1019=1,\"\",IF(U450=\"\",\"\",VLOOKUP(U450,Tabelle!$B$4:$O$6,14,FALSE)))","v":""},{"$f":"IF(M$1019=1,\"\",IF(U450=\"\",\"\",VLOOKUP(U450,Tabelle!$B$4:$Q$6,16,FALSE)))","v":""},null,null,null,null,null,null,null,{"$f":"IF(B450=\"\",0,IF(B450=B449,COUNTIF(B$9:B449,B450)+1,1))","v":438},0,0]
["443","-1900","-1900-439",null,null,null,null,null,null,null,null,null,null,null,null,null,null,null,null,null,null,{"$f":"IF(M$1019=1,\"\",IF(U451=\"\",\"\",VLOOKUP(U451,Tabelle!$B$4:$O$6,14,FALSE)))","v":""},{"$f":"IF(M$1019=1,\"\",IF(U451=\"\",\"\",VLOOKUP(U451,Tabelle!$B$4:$Q$6,16,FALSE)))","v":""},null,null,null,null,null,null,null,{"$f":"IF(B451=\"\",0,IF(B451=B450,COUNTIF(B$9:B450,B451)+1,1))","v":439},0,0]
["444","-1900","-1900-440",null,null,null,null,null,null,null,null,null,null,null,null,null,null,null,null,null,null,{"$f":"IF(M$1019=1,\"\",IF(U452=\"\",\"\",VLOOKUP(U452,Tabelle!$B$4:$O$6,14,FALSE)))","v":""},{"$f":"IF(M$1019=1,\"\",IF(U452=\"\",\"\",VLOOKUP(U452,Tabelle!$B$4:$Q$6,16,FALSE)))","v":""},null,null,null,null,null,null,null,{"$f":"IF(B452=\"\",0,IF(B452=B451,COUNTIF(B$9:B451,B452)+1,1))","v":440},0,0]
["445","-1900","-1900-441",null,null,null,null,null,null,null,null,null,null,null,null,null,null,null,null,null,null,{"$f":"IF(M$1019=1,\"\",IF(U453=\"\",\"\",VLOOKUP(U453,Tabelle!$B$4:$O$6,14,FALSE)))","v":""},{"$f":"IF(M$1019=1,\"\",IF(U453=\"\",\"\",VLOOKUP(U453,Tabelle!$B$4:$Q$6,16,FALSE)))","v":""},null,null,null,null,null,null,null,{"$f":"IF(B453=\"\",0,IF(B453=B452,COUNTIF(B$9:B452,B453)+1,1))","v":441},0,0]
["446","-1900","-1900-442",null,null,null,null,null,null,null,null,null,null,null,null,null,null,null,null,null,null,{"$f":"IF(M$1019=1,\"\",IF(U454=\"\",\"\",VLOOKUP(U454,Tabelle!$B$4:$O$6,14,FALSE)))","v":""},{"$f":"IF(M$1019=1,\"\",IF(U454=\"\",\"\",VLOOKUP(U454,Tabelle!$B$4:$Q$6,16,FALSE)))","v":""},null,null,null,null,null,null,null,{"$f":"IF(B454=\"\",0,IF(B454=B453,COUNTIF(B$9:B453,B454)+1,1))","v":442},0,0]
["447","-1900","-1900-443",null,null,null,null,null,null,null,null,null,null,null,null,null,null,null,null,null,null,{"$f":"IF(M$1019=1,\"\",IF(U455=\"\",\"\",VLOOKUP(U455,Tabelle!$B$4:$O$6,14,FALSE)))","v":""},{"$f":"IF(M$1019=1,\"\",IF(U455=\"\",\"\",VLOOKUP(U455,Tabelle!$B$4:$Q$6,16,FALSE)))","v":""},null,null,null,null,null,null,null,{"$f":"IF(B455=\"\",0,IF(B455=B454,COUNTIF(B$9:B454,B455)+1,1))","v":443},0,0]
["448","-1900","-1900-444",null,null,null,null,null,null,null,null,null,null,null,null,null,null,null,null,null,null,{"$f":"IF(M$1019=1,\"\",IF(U456=\"\",\"\",VLOOKUP(U456,Tabelle!$B$4:$O$6,14,FALSE)))","v":""},{"$f":"IF(M$1019=1,\"\",IF(U456=\"\",\"\",VLOOKUP(U456,Tabelle!$B$4:$Q$6,16,FALSE)))","v":""},null,null,null,null,null,null,null,{"$f":"IF(B456=\"\",0,IF(B456=B455,COUNTIF(B$9:B455,B456)+1,1))","v":444},0,0]
["449","-1900","-1900-445",null,null,null,null,null,null,null,null,null,null,null,null,null,null,null,null,null,null,{"$f":"IF(M$1019=1,\"\",IF(U457=\"\",\"\",VLOOKUP(U457,Tabelle!$B$4:$O$6,14,FALSE)))","v":""},{"$f":"IF(M$1019=1,\"\",IF(U457=\"\",\"\",VLOOKUP(U457,Tabelle!$B$4:$Q$6,16,FALSE)))","v":""},null,null,null,null,null,null,null,{"$f":"IF(B457=\"\",0,IF(B457=B456,COUNTIF(B$9:B456,B457)+1,1))","v":445},0,0]
["450",{"$f":"IF(AG458=$AG$1013,0,IF(M$1019=1,0,D458&\"-\"&YEAR(E458)))","v":"-1900"},"-1900-446",null,null,null,null,null,null,null,null,null,null,null,null,null,null,null,null,null,null,{"$f":"IF(M$1019=1,\"\",IF(U458=\"\",\"\",VLOOKUP(U458,Tabelle!$B$4:$O$6,14,FALSE)))","v":""},{"$f":"IF(M$1019=1,\"\",IF(U458=\"\",\"\",VLOOKUP(U458,Tabelle!$B$4:$Q$6,16,FALSE)))","v":""},null,null,null,null,null,null,null,{"$f":"IF(B458=\"\",0,IF(B458=B457,COUNTIF(B$9:B457,B458)+1,1))","v":446},0,{"$f":"IF(E458>0,IF(OR(MONTH(E458)<$L$1030,MONTH(E458)>$L$1031),AG$1013,0),0)","v":0}]
["451","-1900","-1900-447",null,null,null,null,null,null,null,null,null,null,null,null,null,null,null,null,null,null,{"$f":"IF(M$1019=1,\"\",IF(U459=\"\",\"\",VLOOKUP(U459,Tabelle!$B$4:$O$6,14,FALSE)))","v":""},{"$f":"IF(M$1019=1,\"\",IF(U459=\"\",\"\",VLOOKUP(U459,Tabelle!$B$4:$Q$6,16,FALSE)))","v":""},null,null,null,null,null,null,null,{"$f":"IF(B459=\"\",0,IF(B459=B458,COUNTIF(B$9:B458,B459)+1,1))","v":447},0,0]
["452","-1900","-1900-448",null,null,null,null,null,null,null,null,null,null,null,null,null,null,null,null,null,null,{"$f":"IF(M$1019=1,\"\",IF(U460=\"\",\"\",VLOOKUP(U460,Tabelle!$B$4:$O$6,14,FALSE)))","v":""},{"$f":"IF(M$1019=1,\"\",IF(U460=\"\",\"\",VLOOKUP(U460,Tabelle!$B$4:$Q$6,16,FALSE)))","v":""},null,null,null,null,null,null,null,{"$f":"IF(B460=\"\",0,IF(B460=B459,COUNTIF(B$9:B459,B460)+1,1))","v":448},0,0]
["453","-1900","-1900-449",null,null,null,null,null,null,null,null,null,null,null,null,null,null,null,null,null,null,{"$f":"IF(M$1019=1,\"\",IF(U461=\"\",\"\",VLOOKUP(U461,Tabelle!$B$4:$O$6,14,FALSE)))","v":""},{"$f":"IF(M$1019=1,\"\",IF(U461=\"\",\"\",VLOOKUP(U461,Tabelle!$B$4:$Q$6,16,FALSE)))","v":""},null,null,null,null,null,null,null,{"$f":"IF(B461=\"\",0,IF(B461=B460,COUNTIF(B$9:B460,B461)+1,1))","v":449},0,0]
["454","-1900","-1900-450",null,null,null,null,null,null,null,null,null,null,null,null,null,null,null,null,null,null,{"$f":"IF(M$1019=1,\"\",IF(U462=\"\",\"\",VLOOKUP(U462,Tabelle!$B$4:$O$6,14,FALSE)))","v":""},{"$f":"IF(M$1019=1,\"\",IF(U462=\"\",\"\",VLOOKUP(U462,Tabelle!$B$4:$Q$6,16,FALSE)))","v":""},null,null,null,null,null,null,null,{"$f":"IF(B462=\"\",0,IF(B462=B461,COUNTIF(B$9:B461,B462)+1,1))","v":450},0,0]
["455","-1900","-1900-451",null,null,null,null,null,null,null,null,null,null,null,null,null,null,null,null,null,null,{"$f":"IF(M$1019=1,\"\",IF(U463=\"\",\"\",VLOOKUP(U463,Tabelle!$B$4:$O$6,14,FALSE)))","v":""},{"$f":"IF(M$1019=1,\"\",IF(U463=\"\",\"\",VLOOKUP(U463,Tabelle!$B$4:$Q$6,16,FALSE)))","v":""},null,null,null,null,null,null,null,{"$f":"IF(B463=\"\",0,IF(B463=B462,COUNTIF(B$9:B462,B463)+1,1))","v":451},0,0]
["456","-1900","-1900-452",null,null,null,null,null,null,null,null,null,null,null,null,null,null,null,null,null,null,{"$f":"IF(M$1019=1,\"\",IF(U464=\"\",\"\",VLOOKUP(U464,Tabelle!$B$4:$O$6,14,FALSE)))","v":""},{"$f":"IF(M$1019=1,\"\",IF(U464=\"\",\"\",VLOOKUP(U464,Tabelle!$B$4:$Q$6,16,FALSE)))","v":""},null,null,null,null,null,null,null,{"$f":"IF(B464=\"\",0,IF(B464=B463,COUNTIF(B$9:B463,B464)+1,1))","v":452},0,0]
["457","-1900","-1900-453",null,null,null,null,null,null,null,null,null,null,null,null,null,null,null,null,null,null,{"$f":"IF(M$1019=1,\"\",IF(U465=\"\",\"\",VLOOKUP(U465,Tabelle!$B$4:$O$6,14,FALSE)))","v":""},{"$f":"IF(M$1019=1,\"\",IF(U465=\"\",\"\",VLOOKUP(U465,Tabelle!$B$4:$Q$6,16,FALSE)))","v":""},null,null,null,null,null,null,null,{"$f":"IF(B465=\"\",0,IF(B465=B464,COUNTIF(B$9:B464,B465)+1,1))","v":453},0,0]
["458","-1900","-1900-454",null,null,null,null,null,null,null,null,null,null,null,null,null,null,null,null,null,null,{"$f":"IF(M$1019=1,\"\",IF(U466=\"\",\"\",VLOOKUP(U466,Tabelle!$B$4:$O$6,14,FALSE)))","v":""},{"$f":"IF(M$1019=1,\"\",IF(U466=\"\",\"\",VLOOKUP(U466,Tabelle!$B$4:$Q$6,16,FALSE)))","v":""},null,null,null,null,null,null,null,{"$f":"IF(B466=\"\",0,IF(B466=B465,COUNTIF(B$9:B465,B466)+1,1))","v":454},0,0]
["459","-1900","-1900-455",null,null,null,null,null,null,null,null,null,null,null,null,null,null,null,null,null,null,{"$f":"IF(M$1019=1,\"\",IF(U467=\"\",\"\",VLOOKUP(U467,Tabelle!$B$4:$O$6,14,FALSE)))","v":""},{"$f":"IF(M$1019=1,\"\",IF(U467=\"\",\"\",VLOOKUP(U467,Tabelle!$B$4:$Q$6,16,FALSE)))","v":""},null,null,null,null,null,null,null,{"$f":"IF(B467=\"\",0,IF(B467=B466,COUNTIF(B$9:B466,B467)+1,1))","v":455},0,0]
["460","-1900","-1900-456",null,null,null,null,null,null,null,null,null,null,null,null,null,null,null,null,null,null,{"$f":"IF(M$1019=1,\"\",IF(U468=\"\",\"\",VLOOKUP(U468,Tabelle!$B$4:$O$6,14,FALSE)))","v":""},{"$f":"IF(M$1019=1,\"\",IF(U468=\"\",\"\",VLOOKUP(U468,Tabelle!$B$4:$Q$6,16,FALSE)))","v":""},null,null,null,null,null,null,null,{"$f":"IF(B468=\"\",0,IF(B468=B467,COUNTIF(B$9:B467,B468)+1,1))","v":456},{"$f":"IF(OR(D468=\"\",M$1019=1),0,IF(AE468=8,1,0))","v":0},0]
["461","-1900","-1900-457",null,null,null,null,null,null,null,null,null,null,null,null,null,null,null,null,null,null,{"$f":"IF(M$1019=1,\"\",IF(U469=\"\",\"\",VLOOKUP(U469,Tabelle!$B$4:$O$6,14,FALSE)))","v":""},{"$f":"IF(M$1019=1,\"\",IF(U469=\"\",\"\",VLOOKUP(U469,Tabelle!$B$4:$Q$6,16,FALSE)))","v":""},null,null,null,null,null,null,null,{"$f":"IF(B469=\"\",0,IF(B469=B468,COUNTIF(B$9:B468,B469)+1,1))","v":457},0,0]
["462","-1900","-1900-458",null,null,null,null,null,null,null,null,null,null,null,null,null,null,null,null,null,null,{"$f":"IF(M$1019=1,\"\",IF(U470=\"\",\"\",VLOOKUP(U470,Tabelle!$B$4:$O$6,14,FALSE)))","v":""},{"$f":"IF(M$1019=1,\"\",IF(U470=\"\",\"\",VLOOKUP(U470,Tabelle!$B$4:$Q$6,16,FALSE)))","v":""},null,null,null,null,null,null,null,{"$f":"IF(B470=\"\",0,IF(B470=B469,COUNTIF(B$9:B469,B470)+1,1))","v":458},0,0]
["463","-1900","-1900-459",null,null,null,null,null,null,null,null,null,null,null,null,null,null,null,null,null,null,{"$f":"IF(M$1019=1,\"\",IF(U471=\"\",\"\",VLOOKUP(U471,Tabelle!$B$4:$O$6,14,FALSE)))","v":""},{"$f":"IF(M$1019=1,\"\",IF(U471=\"\",\"\",VLOOKUP(U471,Tabelle!$B$4:$Q$6,16,FALSE)))","v":""},null,null,null,null,null,null,null,{"$f":"IF(B471=\"\",0,IF(B471=B470,COUNTIF(B$9:B470,B471)+1,1))","v":459},0,0]
["464","-1900","-1900-460",null,null,null,null,null,null,null,null,null,null,null,null,null,null,null,null,null,null,{"$f":"IF(M$1019=1,\"\",IF(U472=\"\",\"\",VLOOKUP(U472,Tabelle!$B$4:$O$6,14,FALSE)))","v":""},{"$f":"IF(M$1019=1,\"\",IF(U472=\"\",\"\",VLOOKUP(U472,Tabelle!$B$4:$Q$6,16,FALSE)))","v":""},null,null,null,null,null,null,null,{"$f":"IF(B472=\"\",0,IF(B472=B471,COUNTIF(B$9:B471,B472)+1,1))","v":460},0,0]
["465","-1900","-1900-461",null,null,null,null,null,null,null,null,null,null,null,null,null,null,null,null,null,null,{"$f":"IF(M$1019=1,\"\",IF(U473=\"\",\"\",VLOOKUP(U473,Tabelle!$B$4:$O$6,14,FALSE)))","v":""},{"$f":"IF(M$1019=1,\"\",IF(U473=\"\",\"\",VLOOKUP(U473,Tabelle!$B$4:$Q$6,16,FALSE)))","v":""},null,null,null,null,null,null,null,{"$f":"IF(B473=\"\",0,IF(B473=B472,COUNTIF(B$9:B472,B473)+1,1))","v":461},0,0]
["466","-1900","-1900-462",null,null,null,null,null,null,null,null,null,null,null,null,null,null,null,null,null,null,{"$f":"IF(M$1019=1,\"\",IF(U474=\"\",\"\",VLOOKUP(U474,Tabelle!$B$4:$O$6,14,FALSE)))","v":""},{"$f":"IF(M$1019=1,\"\",IF(U474=\"\",\"\",VLOOKUP(U474,Tabelle!$B$4:$Q$6,16,FALSE)))","v":""},null,null,null,null,null,null,null,{"$f":"IF(B474=\"\",0,IF(B474=B473,COUNTIF(B$9:B473,B474)+1,1))","v":462},0,0]
["467","-1900","-1900-463",null,null,null,null,null,null,null,null,null,null,null,null,null,null,null,null,null,null,{"$f":"IF(M$1019=1,\"\",IF(U475=\"\",\"\",VLOOKUP(U475,Tabelle!$B$4:$O$6,14,FALSE)))","v":""},{"$f":"IF(M$1019=1,\"\",IF(U475=\"\",\"\",VLOOKUP(U475,Tabelle!$B$4:$Q$6,16,FALSE)))","v":""},null,null,null,null,null,null,null,{"$f":"IF(B475=\"\",0,IF(B475=B474,COUNTIF(B$9:B474,B475)+1,1))","v":463},0,0]
["468","-1900","-1900-464",null,null,null,null,null,null,null,null,null,null,null,null,null,null,null,null,null,null,{"$f":"IF(M$1019=1,\"\",IF(U476=\"\",\"\",VLOOKUP(U476,Tabelle!$B$4:$O$6,14,FALSE)))","v":""},{"$f":"IF(M$1019=1,\"\",IF(U476=\"\",\"\",VLOOKUP(U476,Tabelle!$B$4:$Q$6,16,FALSE)))","v":""},null,null,null,null,null,null,null,{"$f":"IF(B476=\"\",0,IF(B476=B475,COUNTIF(B$9:B475,B476)+1,1))","v":464},0,0]
["469","-1900","-1900-465",null,null,null,null,null,null,null,null,null,null,null,null,null,null,null,null,null,null,{"$f":"IF(M$1019=1,\"\",IF(U477=\"\",\"\",VLOOKUP(U477,Tabelle!$B$4:$O$6,14,FALSE)))","v":""},{"$f":"IF(M$1019=1,\"\",IF(U477=\"\",\"\",VLOOKUP(U477,Tabelle!$B$4:$Q$6,16,FALSE)))","v":""},null,null,null,null,null,null,null,{"$f":"IF(B477=\"\",0,IF(B477=B476,COUNTIF(B$9:B476,B477)+1,1))","v":465},0,0]
["470","-1900","-1900-466",null,null,null,null,null,null,null,null,null,null,null,null,null,null,null,null,null,null,{"$f":"IF(M$1019=1,\"\",IF(U478=\"\",\"\",VLOOKUP(U478,Tabelle!$B$4:$O$6,14,FALSE)))","v":""},{"$f":"IF(M$1019=1,\"\",IF(U478=\"\",\"\",VLOOKUP(U478,Tabelle!$B$4:$Q$6,16,FALSE)))","v":""},null,null,null,null,null,null,null,{"$f":"IF(B478=\"\",0,IF(B478=B477,COUNTIF(B$9:B477,B478)+1,1))","v":466},0,0]
["471","-1900","-1900-467",null,null,null,null,null,null,null,null,null,null,null,null,null,null,null,null,null,null,{"$f":"IF(M$1019=1,\"\",IF(U479=\"\",\"\",VLOOKUP(U479,Tabelle!$B$4:$O$6,14,FALSE)))","v":""},{"$f":"IF(M$1019=1,\"\",IF(U479=\"\",\"\",VLOOKUP(U479,Tabelle!$B$4:$Q$6,16,FALSE)))","v":""},null,null,null,null,null,null,null,{"$f":"IF(B479=\"\",0,IF(B479=B478,COUNTIF(B$9:B478,B479)+1,1))","v":467},0,0]
["472","-1900","-1900-468",null,null,null,null,null,null,null,null,null,null,null,null,null,null,null,null,null,null,{"$f":"IF(M$1019=1,\"\",IF(U480=\"\",\"\",VLOOKUP(U480,Tabelle!$B$4:$O$6,14,FALSE)))","v":""},{"$f":"IF(M$1019=1,\"\",IF(U480=\"\",\"\",VLOOKUP(U480,Tabelle!$B$4:$Q$6,16,FALSE)))","v":""},null,null,null,null,null,null,null,{"$f":"IF(B480=\"\",0,IF(B480=B479,COUNTIF(B$9:B479,B480)+1,1))","v":468},0,0]
["473","-1900","-1900-469",null,null,null,null,null,null,null,null,null,null,null,null,null,null,null,null,null,null,{"$f":"IF(M$1019=1,\"\",IF(U481=\"\",\"\",VLOOKUP(U481,Tabelle!$B$4:$O$6,14,FALSE)))","v":""},{"$f":"IF(M$1019=1,\"\",IF(U481=\"\",\"\",VLOOKUP(U481,Tabelle!$B$4:$Q$6,16,FALSE)))","v":""},null,null,null,null,null,null,null,{"$f":"IF(B481=\"\",0,IF(B481=B480,COUNTIF(B$9:B480,B481)+1,1))","v":469},0,0]
["474","-1900","-1900-470",null,null,null,null,null,null,null,null,null,null,null,null,null,null,null,null,null,null,{"$f":"IF(M$1019=1,\"\",IF(U482=\"\",\"\",VLOOKUP(U482,Tabelle!$B$4:$O$6,14,FALSE)))","v":""},{"$f":"IF(M$1019=1,\"\",IF(U482=\"\",\"\",VLOOKUP(U482,Tabelle!$B$4:$Q$6,16,FALSE)))","v":""},null,null,null,null,null,null,null,{"$f":"IF(B482=\"\",0,IF(B482=B481,COUNTIF(B$9:B481,B482)+1,1))","v":470},0,0]
["475","-1900","-1900-471",null,null,null,null,null,null,null,null,null,null,null,null,null,null,null,null,null,null,{"$f":"IF(M$1019=1,\"\",IF(U483=\"\",\"\",VLOOKUP(U483,Tabelle!$B$4:$O$6,14,FALSE)))","v":""},{"$f":"IF(M$1019=1,\"\",IF(U483=\"\",\"\",VLOOKUP(U483,Tabelle!$B$4:$Q$6,16,FALSE)))","v":""},null,null,null,null,null,null,null,{"$f":"IF(B483=\"\",0,IF(B483=B482,COUNTIF(B$9:B482,B483)+1,1))","v":471},0,0]
["476","-1900","-1900-472",null,null,null,null,null,null,null,null,null,null,null,null,null,null,null,null,null,null,{"$f":"IF(M$1019=1,\"\",IF(U484=\"\",\"\",VLOOKUP(U484,Tabelle!$B$4:$O$6,14,FALSE)))","v":""},{"$f":"IF(M$1019=1,\"\",IF(U484=\"\",\"\",VLOOKUP(U484,Tabelle!$B$4:$Q$6,16,FALSE)))","v":""},null,null,null,null,null,null,null,{"$f":"IF(B484=\"\",0,IF(B484=B483,COUNTIF(B$9:B483,B484)+1,1))","v":472},0,0]
["477","-1900","-1900-473",null,null,null,null,null,null,null,null,null,null,null,null,null,null,null,null,null,null,{"$f":"IF(M$1019=1,\"\",IF(U485=\"\",\"\",VLOOKUP(U485,Tabelle!$B$4:$O$6,14,FALSE)))","v":""},{"$f":"IF(M$1019=1,\"\",IF(U485=\"\",\"\",VLOOKUP(U485,Tabelle!$B$4:$Q$6,16,FALSE)))","v":""},null,null,null,null,null,null,null,{"$f":"IF(B485=\"\",0,IF(B485=B484,COUNTIF(B$9:B484,B485)+1,1))","v":473},0,0]
["478","-1900","-1900-474",null,null,null,null,null,null,null,null,null,null,null,null,null,null,null,null,null,null,{"$f":"IF(M$1019=1,\"\",IF(U486=\"\",\"\",VLOOKUP(U486,Tabelle!$B$4:$O$6,14,FALSE)))","v":""},{"$f":"IF(M$1019=1,\"\",IF(U486=\"\",\"\",VLOOKUP(U486,Tabelle!$B$4:$Q$6,16,FALSE)))","v":""},null,null,null,null,null,null,null,{"$f":"IF(B486=\"\",0,IF(B486=B485,COUNTIF(B$9:B485,B486)+1,1))","v":474},0,0]
["479","-1900","-1900-475",null,null,null,null,null,null,null,null,null,null,null,null,null,null,null,null,null,null,{"$f":"IF(M$1019=1,\"\",IF(U487=\"\",\"\",VLOOKUP(U487,Tabelle!$B$4:$O$6,14,FALSE)))","v":""},{"$f":"IF(M$1019=1,\"\",IF(U487=\"\",\"\",VLOOKUP(U487,Tabelle!$B$4:$Q$6,16,FALSE)))","v":""},null,null,null,null,null,null,null,{"$f":"IF(B487=\"\",0,IF(B487=B486,COUNTIF(B$9:B486,B487)+1,1))","v":475},0,0]
["480","-1900","-1900-476",null,null,null,null,null,null,null,null,null,null,null,null,null,null,null,null,null,null,{"$f":"IF(M$1019=1,\"\",IF(U488=\"\",\"\",VLOOKUP(U488,Tabelle!$B$4:$O$6,14,FALSE)))","v":""},{"$f":"IF(M$1019=1,\"\",IF(U488=\"\",\"\",VLOOKUP(U488,Tabelle!$B$4:$Q$6,16,FALSE)))","v":""},null,null,null,null,null,null,null,{"$f":"IF(B488=\"\",0,IF(B488=B487,COUNTIF(B$9:B487,B488)+1,1))","v":476},0,0]
["481","-1900","-1900-477",null,null,null,null,null,null,null,null,null,null,null,null,null,null,null,null,null,null,{"$f":"IF(M$1019=1,\"\",IF(U489=\"\",\"\",VLOOKUP(U489,Tabelle!$B$4:$O$6,14,FALSE)))","v":""},{"$f":"IF(M$1019=1,\"\",IF(U489=\"\",\"\",VLOOKUP(U489,Tabelle!$B$4:$Q$6,16,FALSE)))","v":""},null,null,null,null,null,null,null,{"$f":"IF(B489=\"\",0,IF(B489=B488,COUNTIF(B$9:B488,B489)+1,1))","v":477},0,0]
["482","-1900","-1900-478",null,null,null,null,null,null,null,null,null,null,null,null,null,null,null,null,null,null,{"$f":"IF(M$1019=1,\"\",IF(U490=\"\",\"\",VLOOKUP(U490,Tabelle!$B$4:$O$6,14,FALSE)))","v":""},{"$f":"IF(M$1019=1,\"\",IF(U490=\"\",\"\",VLOOKUP(U490,Tabelle!$B$4:$Q$6,16,FALSE)))","v":""},null,null,null,null,null,null,null,{"$f":"IF(B490=\"\",0,IF(B490=B489,COUNTIF(B$9:B489,B490)+1,1))","v":478},0,0]
["483","-1900","-1900-479",null,null,null,null,null,null,null,null,null,null,null,null,null,null,null,null,null,null,{"$f":"IF(M$1019=1,\"\",IF(U491=\"\",\"\",VLOOKUP(U491,Tabelle!$B$4:$O$6,14,FALSE)))","v":""},{"$f":"IF(M$1019=1,\"\",IF(U491=\"\",\"\",VLOOKUP(U491,Tabelle!$B$4:$Q$6,16,FALSE)))","v":""},null,null,null,null,null,null,null,{"$f":"IF(B491=\"\",0,IF(B491=B490,COUNTIF(B$9:B490,B491)+1,1))","v":479},0,0]
["484","-1900","-1900-480",null,null,null,null,null,null,null,null,null,null,null,null,null,null,null,null,null,null,{"$f":"IF(M$1019=1,\"\",IF(U492=\"\",\"\",VLOOKUP(U492,Tabelle!$B$4:$O$6,14,FALSE)))","v":""},{"$f":"IF(M$1019=1,\"\",IF(U492=\"\",\"\",VLOOKUP(U492,Tabelle!$B$4:$Q$6,16,FALSE)))","v":""},null,null,null,null,null,null,null,{"$f":"IF(B492=\"\",0,IF(B492=B491,COUNTIF(B$9:B491,B492)+1,1))","v":480},0,0]
["485","-1900","-1900-481",null,null,null,null,null,null,null,null,null,null,null,null,null,null,null,null,null,null,{"$f":"IF(M$1019=1,\"\",IF(U493=\"\",\"\",VLOOKUP(U493,Tabelle!$B$4:$O$6,14,FALSE)))","v":""},{"$f":"IF(M$1019=1,\"\",IF(U493=\"\",\"\",VLOOKUP(U493,Tabelle!$B$4:$Q$6,16,FALSE)))","v":""},null,null,null,null,null,null,null,{"$f":"IF(B493=\"\",0,IF(B493=B492,COUNTIF(B$9:B492,B493)+1,1))","v":481},0,0]
["486","-1900","-1900-482",null,null,null,null,null,null,null,null,null,null,null,null,null,null,null,null,null,null,{"$f":"IF(M$1019=1,\"\",IF(U494=\"\",\"\",VLOOKUP(U494,Tabelle!$B$4:$O$6,14,FALSE)))","v":""},{"$f":"IF(M$1019=1,\"\",IF(U494=\"\",\"\",VLOOKUP(U494,Tabelle!$B$4:$Q$6,16,FALSE)))","v":""},null,null,null,null,null,null,null,{"$f":"IF(B494=\"\",0,IF(B494=B493,COUNTIF(B$9:B493,B494)+1,1))","v":482},0,0]
["487","-1900","-1900-483",null,null,null,null,null,null,null,null,null,null,null,null,null,null,null,null,null,null,{"$f":"IF(M$1019=1,\"\",IF(U495=\"\",\"\",VLOOKUP(U495,Tabelle!$B$4:$O$6,14,FALSE)))","v":""},{"$f":"IF(M$1019=1,\"\",IF(U495=\"\",\"\",VLOOKUP(U495,Tabelle!$B$4:$Q$6,16,FALSE)))","v":""},null,null,null,null,null,null,null,{"$f":"IF(B495=\"\",0,IF(B495=B494,COUNTIF(B$9:B494,B495)+1,1))","v":483},0,0]
["488","-1900","-1900-484",null,null,null,null,null,null,null,null,null,null,null,null,null,null,null,null,null,null,{"$f":"IF(M$1019=1,\"\",IF(U496=\"\",\"\",VLOOKUP(U496,Tabelle!$B$4:$O$6,14,FALSE)))","v":""},{"$f":"IF(M$1019=1,\"\",IF(U496=\"\",\"\",VLOOKUP(U496,Tabelle!$B$4:$Q$6,16,FALSE)))","v":""},null,null,null,null,null,null,null,{"$f":"IF(B496=\"\",0,IF(B496=B495,COUNTIF(B$9:B495,B496)+1,1))","v":484},0,0]
["489","-1900","-1900-485",null,null,null,null,null,null,null,null,null,null,null,null,null,null,null,null,null,null,{"$f":"IF(M$1019=1,\"\",IF(U497=\"\",\"\",VLOOKUP(U497,Tabelle!$B$4:$O$6,14,FALSE)))","v":""},{"$f":"IF(M$1019=1,\"\",IF(U497=\"\",\"\",VLOOKUP(U497,Tabelle!$B$4:$Q$6,16,FALSE)))","v":""},null,null,null,null,null,null,null,{"$f":"IF(B497=\"\",0,IF(B497=B496,COUNTIF(B$9:B496,B497)+1,1))","v":485},0,0]
["490","-1900","-1900-486",null,null,null,null,null,null,null,null,null,null,null,null,null,null,null,null,null,null,{"$f":"IF(M$1019=1,\"\",IF(U498=\"\",\"\",VLOOKUP(U498,Tabelle!$B$4:$O$6,14,FALSE)))","v":""},{"$f":"IF(M$1019=1,\"\",IF(U498=\"\",\"\",VLOOKUP(U498,Tabelle!$B$4:$Q$6,16,FALSE)))","v":""},null,null,null,null,null,null,null,{"$f":"IF(B498=\"\",0,IF(B498=B497,COUNTIF(B$9:B497,B498)+1,1))","v":486},0,0]
["491","-1900",{"$f":"IF(M$1019=1,0,B499&\"-\"&AE499)","v":"-1900-487"},null,null,null,null,null,null,null,null,null,null,null,null,null,null,null,null,null,null,{"$f":"IF(M$1019=1,\"\",IF(U499=\"\",\"\",VLOOKUP(U499,Tabelle!$B$4:$O$6,14,FALSE)))","v":""},{"$f":"IF(M$1019=1,\"\",IF(U499=\"\",\"\",VLOOKUP(U499,Tabelle!$B$4:$Q$6,16,FALSE)))","v":""},null,null,null,null,null,null,null,{"$f":"IF(B499=\"\",0,IF(B499=B498,COUNTIF(B$9:B498,B499)+1,1))","v":487},0,0]
["492","-1900","-1900-488",null,null,null,null,null,null,null,null,null,null,null,null,null,null,null,null,null,null,{"$f":"IF(M$1019=1,\"\",IF(U500=\"\",\"\",VLOOKUP(U500,Tabelle!$B$4:$O$6,14,FALSE)))","v":""},{"$f":"IF(M$1019=1,\"\",IF(U500=\"\",\"\",VLOOKUP(U500,Tabelle!$B$4:$Q$6,16,FALSE)))","v":""},null,null,null,null,null,null,null,{"$f":"IF(B500=\"\",0,IF(B500=B499,COUNTIF(B$9:B499,B500)+1,1))","v":488},0,0]
["493","-1900","-1900-489",null,null,null,null,null,null,null,null,null,null,null,null,null,null,null,null,null,null,{"$f":"IF(M$1019=1,\"\",IF(U501=\"\",\"\",VLOOKUP(U501,Tabelle!$B$4:$O$6,14,FALSE)))","v":""},{"$f":"IF(M$1019=1,\"\",IF(U501=\"\",\"\",VLOOKUP(U501,Tabelle!$B$4:$Q$6,16,FALSE)))","v":""},null,null,null,null,null,null,null,{"$f":"IF(B501=\"\",0,IF(B501=B500,COUNTIF(B$9:B500,B501)+1,1))","v":489},0,0]
["494","-1900","-1900-490",null,null,null,null,null,null,null,null,null,null,null,null,null,null,null,null,null,null,{"$f":"IF(M$1019=1,\"\",IF(U502=\"\",\"\",VLOOKUP(U502,Tabelle!$B$4:$O$6,14,FALSE)))","v":""},{"$f":"IF(M$1019=1,\"\",IF(U502=\"\",\"\",VLOOKUP(U502,Tabelle!$B$4:$Q$6,16,FALSE)))","v":""},null,null,null,null,null,null,null,{"$f":"IF(B502=\"\",0,IF(B502=B501,COUNTIF(B$9:B501,B502)+1,1))","v":490},0,0]
["495","-1900","-1900-491",null,null,null,null,null,null,null,null,null,null,null,null,null,null,null,null,null,null,{"$f":"IF(M$1019=1,\"\",IF(U503=\"\",\"\",VLOOKUP(U503,Tabelle!$B$4:$O$6,14,FALSE)))","v":""},{"$f":"IF(M$1019=1,\"\",IF(U503=\"\",\"\",VLOOKUP(U503,Tabelle!$B$4:$Q$6,16,FALSE)))","v":""},null,null,null,null,null,null,null,{"$f":"IF(B503=\"\",0,IF(B503=B502,COUNTIF(B$9:B502,B503)+1,1))","v":491},0,0]
["496","-1900","-1900-492",null,null,null,null,null,null,null,null,null,null,null,null,null,null,null,null,null,null,{"$f":"IF(M$1019=1,\"\",IF(U504=\"\",\"\",VLOOKUP(U504,Tabelle!$B$4:$O$6,14,FALSE)))","v":""},{"$f":"IF(M$1019=1,\"\",IF(U504=\"\",\"\",VLOOKUP(U504,Tabelle!$B$4:$Q$6,16,FALSE)))","v":""},null,null,null,null,null,null,null,{"$f":"IF(B504=\"\",0,IF(B504=B503,COUNTIF(B$9:B503,B504)+1,1))","v":492},0,0]
["497","-1900","-1900-493",null,null,null,null,null,null,null,null,null,null,null,null,null,null,null,null,null,null,{"$f":"IF(M$1019=1,\"\",IF(U505=\"\",\"\",VLOOKUP(U505,Tabelle!$B$4:$O$6,14,FALSE)))","v":""},{"$f":"IF(M$1019=1,\"\",IF(U505=\"\",\"\",VLOOKUP(U505,Tabelle!$B$4:$Q$6,16,FALSE)))","v":""},null,null,null,null,null,null,null,{"$f":"IF(B505=\"\",0,IF(B505=B504,COUNTIF(B$9:B504,B505)+1,1))","v":493},0,0]
["498","-1900","-1900-494",null,null,null,null,null,null,null,null,null,null,null,null,null,null,null,null,null,null,{"$f":"IF(M$1019=1,\"\",IF(U506=\"\",\"\",VLOOKUP(U506,Tabelle!$B$4:$O$6,14,FALSE)))","v":""},{"$f":"IF(M$1019=1,\"\",IF(U506=\"\",\"\",VLOOKUP(U506,Tabelle!$B$4:$Q$6,16,FALSE)))","v":""},null,null,null,null,null,null,null,{"$f":"IF(B506=\"\",0,IF(B506=B505,COUNTIF(B$9:B505,B506)+1,1))","v":494},0,0]
["499","-1900","-1900-495",null,null,null,null,null,null,null,null,null,null,null,null,null,null,null,null,null,null,{"$f":"IF(M$1019=1,\"\",IF(U507=\"\",\"\",VLOOKUP(U507,Tabelle!$B$4:$O$6,14,FALSE)))","v":""},{"$f":"IF(M$1019=1,\"\",IF(U507=\"\",\"\",VLOOKUP(U507,Tabelle!$B$4:$Q$6,16,FALSE)))","v":""},null,null,null,null,null,null,null,{"$f":"IF(B507=\"\",0,IF(B507=B506,COUNTIF(B$9:B506,B507)+1,1))","v":495},0,0]
["500 di 1000","-1900","-1900-496",null,null,null,null,null,null,null,null,null,null,null,null,null,null,null,null,null,null,{"$f":"IF(M$1019=1,\"\",IF(U508=\"\",\"\",VLOOKUP(U508,Tabelle!$B$4:$O$6,14,FALSE)))","v":""},{"$f":"IF(M$1019=1,\"\",IF(U508=\"\",\"\",VLOOKUP(U508,Tabelle!$B$4:$Q$6,16,FALSE)))","v":""},null,null,null,null,null,null,null,{"$f":"IF(B508=\"\",0,IF(B508=B507,COUNTIF(B$9:B507,B508)+1,1))","v":496},0,0]
["501","-1900","-1900-497",null,null,null,null,null,null,null,null,null,null,null,null,null,null,null,null,null,null,{"$f":"IF(M$1019=1,\"\",IF(U509=\"\",\"\",VLOOKUP(U509,Tabelle!$B$4:$O$6,14,FALSE)))","v":""},{"$f":"IF(M$1019=1,\"\",IF(U509=\"\",\"\",VLOOKUP(U509,Tabelle!$B$4:$Q$6,16,FALSE)))","v":""},null,null,null,null,null,null,null,{"$f":"IF(B509=\"\",0,IF(B509=B508,COUNTIF(B$9:B508,B509)+1,1))","v":497},0,0]
["502","-1900","-1900-498",null,null,null,null,null,null,null,null,null,null,null,null,null,null,null,null,null,null,{"$f":"IF(M$1019=1,\"\",IF(U510=\"\",\"\",VLOOKUP(U510,Tabelle!$B$4:$O$6,14,FALSE)))","v":""},{"$f":"IF(M$1019=1,\"\",IF(U510=\"\",\"\",VLOOKUP(U510,Tabelle!$B$4:$Q$6,16,FALSE)))","v":""},null,null,null,null,null,null,null,{"$f":"IF(B510=\"\",0,IF(B510=B509,COUNTIF(B$9:B509,B510)+1,1))","v":498},0,0]
["503","-1900","-1900-499",null,null,null,null,null,null,null,null,null,null,null,null,null,null,null,null,null,null,{"$f":"IF(M$1019=1,\"\",IF(U511=\"\",\"\",VLOOKUP(U511,Tabelle!$B$4:$O$6,14,FALSE)))","v":""},{"$f":"IF(M$1019=1,\"\",IF(U511=\"\",\"\",VLOOKUP(U511,Tabelle!$B$4:$Q$6,16,FALSE)))","v":""},null,null,null,null,null,null,null,{"$f":"IF(B511=\"\",0,IF(B511=B510,COUNTIF(B$9:B510,B511)+1,1))","v":499},0,0]
["504","-1900","-1900-500",null,null,null,null,null,null,null,null,null,null,null,null,null,null,null,null,null,null,{"$f":"IF(M$1019=1,\"\",IF(U512=\"\",\"\",VLOOKUP(U512,Tabelle!$B$4:$O$6,14,FALSE)))","v":""},{"$f":"IF(M$1019=1,\"\",IF(U512=\"\",\"\",VLOOKUP(U512,Tabelle!$B$4:$Q$6,16,FALSE)))","v":""},null,null,null,null,null,null,null,{"$f":"IF(B512=\"\",0,IF(B512=B511,COUNTIF(B$9:B511,B512)+1,1))","v":500},0,0]
["505","-1900","-1900-501",null,null,null,null,null,null,null,null,null,null,null,null,null,null,null,null,null,null,{"$f":"IF(M$1019=1,\"\",IF(U513=\"\",\"\",VLOOKUP(U513,Tabelle!$B$4:$O$6,14,FALSE)))","v":""},{"$f":"IF(M$1019=1,\"\",IF(U513=\"\",\"\",VLOOKUP(U513,Tabelle!$B$4:$Q$6,16,FALSE)))","v":""},null,null,null,null,null,null,null,{"$f":"IF(B513=\"\",0,IF(B513=B512,COUNTIF(B$9:B512,B513)+1,1))","v":501},0,0]
["506","-1900","-1900-502",null,null,null,null,null,null,null,null,null,null,null,null,null,null,null,null,null,null,{"$f":"IF(M$1019=1,\"\",IF(U514=\"\",\"\",VLOOKUP(U514,Tabelle!$B$4:$O$6,14,FALSE)))","v":""},{"$f":"IF(M$1019=1,\"\",IF(U514=\"\",\"\",VLOOKUP(U514,Tabelle!$B$4:$Q$6,16,FALSE)))","v":""},null,null,null,null,null,null,null,{"$f":"IF(B514=\"\",0,IF(B514=B513,COUNTIF(B$9:B513,B514)+1,1))","v":502},0,0]
["507","-1900","-1900-503",null,null,null,null,null,null,null,null,null,null,null,null,null,null,null,null,null,null,{"$f":"IF(M$1019=1,\"\",IF(U515=\"\",\"\",VLOOKUP(U515,Tabelle!$B$4:$O$6,14,FALSE)))","v":""},{"$f":"IF(M$1019=1,\"\",IF(U515=\"\",\"\",VLOOKUP(U515,Tabelle!$B$4:$Q$6,16,FALSE)))","v":""},null,null,null,null,null,null,null,{"$f":"IF(B515=\"\",0,IF(B515=B514,COUNTIF(B$9:B514,B515)+1,1))","v":503},0,0]
["508","-1900","-1900-504",null,null,null,null,null,null,null,null,null,null,null,null,null,null,null,null,null,null,{"$f":"IF(M$1019=1,\"\",IF(U516=\"\",\"\",VLOOKUP(U516,Tabelle!$B$4:$O$6,14,FALSE)))","v":""},{"$f":"IF(M$1019=1,\"\",IF(U516=\"\",\"\",VLOOKUP(U516,Tabelle!$B$4:$Q$6,16,FALSE)))","v":""},null,null,null,null,null,null,null,{"$f":"IF(B516=\"\",0,IF(B516=B515,COUNTIF(B$9:B515,B516)+1,1))","v":504},0,0]
["509","-1900","-1900-505",null,null,null,null,null,null,null,null,null,null,null,null,null,null,null,null,null,null,{"$f":"IF(M$1019=1,\"\",IF(U517=\"\",\"\",VLOOKUP(U517,Tabelle!$B$4:$O$6,14,FALSE)))","v":""},{"$f":"IF(M$1019=1,\"\",IF(U517=\"\",\"\",VLOOKUP(U517,Tabelle!$B$4:$Q$6,16,FALSE)))","v":""},null,null,null,null,null,null,null,{"$f":"IF(B517=\"\",0,IF(B517=B516,COUNTIF(B$9:B516,B517)+1,1))","v":505},0,0]
["510","-1900","-1900-506",null,null,null,null,null,null,null,null,null,null,null,null,null,null,null,null,null,null,{"$f":"IF(M$1019=1,\"\",IF(U518=\"\",\"\",VLOOKUP(U518,Tabelle!$B$4:$O$6,14,FALSE)))","v":""},{"$f":"IF(M$1019=1,\"\",IF(U518=\"\",\"\",VLOOKUP(U518,Tabelle!$B$4:$Q$6,16,FALSE)))","v":""},null,null,null,null,null,null,null,{"$f":"IF(B518=\"\",0,IF(B518=B517,COUNTIF(B$9:B517,B518)+1,1))","v":506},0,0]
["511","-1900","-1900-507",null,null,null,null,null,null,null,null,null,null,null,null,null,null,null,null,null,null,{"$f":"IF(M$1019=1,\"\",IF(U519=\"\",\"\",VLOOKUP(U519,Tabelle!$B$4:$O$6,14,FALSE)))","v":""},{"$f":"IF(M$1019=1,\"\",IF(U519=\"\",\"\",VLOOKUP(U519,Tabelle!$B$4:$Q$6,16,FALSE)))","v":""},null,null,null,null,null,null,null,{"$f":"IF(B519=\"\",0,IF(B519=B518,COUNTIF(B$9:B518,B519)+1,1))","v":507},0,0]
["512","-1900","-1900-508",null,null,null,null,null,null,null,null,null,null,null,null,null,null,null,null,null,null,{"$f":"IF(M$1019=1,\"\",IF(U520=\"\",\"\",VLOOKUP(U520,Tabelle!$B$4:$O$6,14,FALSE)))","v":""},{"$f":"IF(M$1019=1,\"\",IF(U520=\"\",\"\",VLOOKUP(U520,Tabelle!$B$4:$Q$6,16,FALSE)))","v":""},null,null,null,null,null,null,null,{"$f":"IF(B520=\"\",0,IF(B520=B519,COUNTIF(B$9:B519,B520)+1,1))","v":508},0,0]
["513","-1900","-1900-509",null,null,null,null,null,null,null,null,null,null,null,null,null,null,null,null,null,null,{"$f":"IF(M$1019=1,\"\",IF(U521=\"\",\"\",VLOOKUP(U521,Tabelle!$B$4:$O$6,14,FALSE)))","v":""},{"$f":"IF(M$1019=1,\"\",IF(U521=\"\",\"\",VLOOKUP(U521,Tabelle!$B$4:$Q$6,16,FALSE)))","v":""},null,null,null,null,null,null,null,{"$f":"IF(B521=\"\",0,IF(B521=B520,COUNTIF(B$9:B520,B521)+1,1))","v":509},0,0]
["514",{"$f":"IF(AG522=$AG$1013,0,IF(M$1019=1,0,D522&\"-\"&YEAR(E522)))","v":"-1900"},"-1900-510",null,null,null,null,null,null,null,null,null,null,null,null,null,null,null,null,null,null,{"$f":"IF(M$1019=1,\"\",IF(U522=\"\",\"\",VLOOKUP(U522,Tabelle!$B$4:$O$6,14,FALSE)))","v":""},{"$f":"IF(M$1019=1,\"\",IF(U522=\"\",\"\",VLOOKUP(U522,Tabelle!$B$4:$Q$6,16,FALSE)))","v":""},null,null,null,null,null,null,null,{"$f":"IF(B522=\"\",0,IF(B522=B521,COUNTIF(B$9:B521,B522)+1,1))","v":510},0,{"$f":"IF(E522>0,IF(OR(MONTH(E522)<$L$1030,MONTH(E522)>$L$1031),AG$1013,0),0)","v":0}]
["515","-1900","-1900-511",null,null,null,null,null,null,null,null,null,null,null,null,null,null,null,null,null,null,{"$f":"IF(M$1019=1,\"\",IF(U523=\"\",\"\",VLOOKUP(U523,Tabelle!$B$4:$O$6,14,FALSE)))","v":""},{"$f":"IF(M$1019=1,\"\",IF(U523=\"\",\"\",VLOOKUP(U523,Tabelle!$B$4:$Q$6,16,FALSE)))","v":""},null,null,null,null,null,null,null,{"$f":"IF(B523=\"\",0,IF(B523=B522,COUNTIF(B$9:B522,B523)+1,1))","v":511},0,0]
["516","-1900","-1900-512",null,null,null,null,null,null,null,null,null,null,null,null,null,null,null,null,null,null,{"$f":"IF(M$1019=1,\"\",IF(U524=\"\",\"\",VLOOKUP(U524,Tabelle!$B$4:$O$6,14,FALSE)))","v":""},{"$f":"IF(M$1019=1,\"\",IF(U524=\"\",\"\",VLOOKUP(U524,Tabelle!$B$4:$Q$6,16,FALSE)))","v":""},null,null,null,null,null,null,null,{"$f":"IF(B524=\"\",0,IF(B524=B523,COUNTIF(B$9:B523,B524)+1,1))","v":512},0,0]
["517","-1900","-1900-513",null,null,null,null,null,null,null,null,null,null,null,null,null,null,null,null,null,null,{"$f":"IF(M$1019=1,\"\",IF(U525=\"\",\"\",VLOOKUP(U525,Tabelle!$B$4:$O$6,14,FALSE)))","v":""},{"$f":"IF(M$1019=1,\"\",IF(U525=\"\",\"\",VLOOKUP(U525,Tabelle!$B$4:$Q$6,16,FALSE)))","v":""},null,null,null,null,null,null,null,{"$f":"IF(B525=\"\",0,IF(B525=B524,COUNTIF(B$9:B524,B525)+1,1))","v":513},0,0]
["518","-1900","-1900-514",null,null,null,null,null,null,null,null,null,null,null,null,null,null,null,null,null,null,{"$f":"IF(M$1019=1,\"\",IF(U526=\"\",\"\",VLOOKUP(U526,Tabelle!$B$4:$O$6,14,FALSE)))","v":""},{"$f":"IF(M$1019=1,\"\",IF(U526=\"\",\"\",VLOOKUP(U526,Tabelle!$B$4:$Q$6,16,FALSE)))","v":""},null,null,null,null,null,null,null,{"$f":"IF(B526=\"\",0,IF(B526=B525,COUNTIF(B$9:B525,B526)+1,1))","v":514},0,0]
["519","-1900","-1900-515",null,null,null,null,null,null,null,null,null,null,null,null,null,null,null,null,null,null,{"$f":"IF(M$1019=1,\"\",IF(U527=\"\",\"\",VLOOKUP(U527,Tabelle!$B$4:$O$6,14,FALSE)))","v":""},{"$f":"IF(M$1019=1,\"\",IF(U527=\"\",\"\",VLOOKUP(U527,Tabelle!$B$4:$Q$6,16,FALSE)))","v":""},null,null,null,null,null,null,null,{"$f":"IF(B527=\"\",0,IF(B527=B526,COUNTIF(B$9:B526,B527)+1,1))","v":515},0,0]
["520","-1900","-1900-516",null,null,null,null,null,null,null,null,null,null,null,null,null,null,null,null,null,null,{"$f":"IF(M$1019=1,\"\",IF(U528=\"\",\"\",VLOOKUP(U528,Tabelle!$B$4:$O$6,14,FALSE)))","v":""},{"$f":"IF(M$1019=1,\"\",IF(U528=\"\",\"\",VLOOKUP(U528,Tabelle!$B$4:$Q$6,16,FALSE)))","v":""},null,null,null,null,null,null,null,{"$f":"IF(B528=\"\",0,IF(B528=B527,COUNTIF(B$9:B527,B528)+1,1))","v":516},0,0]
["521","-1900","-1900-517",null,null,null,null,null,null,null,null,null,null,null,null,null,null,null,null,null,null,{"$f":"IF(M$1019=1,\"\",IF(U529=\"\",\"\",VLOOKUP(U529,Tabelle!$B$4:$O$6,14,FALSE)))","v":""},{"$f":"IF(M$1019=1,\"\",IF(U529=\"\",\"\",VLOOKUP(U529,Tabelle!$B$4:$Q$6,16,FALSE)))","v":""},null,null,null,null,null,null,null,{"$f":"IF(B529=\"\",0,IF(B529=B528,COUNTIF(B$9:B528,B529)+1,1))","v":517},0,0]
["522","-1900","-1900-518",null,null,null,null,null,null,null,null,null,null,null,null,null,null,null,null,null,null,{"$f":"IF(M$1019=1,\"\",IF(U530=\"\",\"\",VLOOKUP(U530,Tabelle!$B$4:$O$6,14,FALSE)))","v":""},{"$f":"IF(M$1019=1,\"\",IF(U530=\"\",\"\",VLOOKUP(U530,Tabelle!$B$4:$Q$6,16,FALSE)))","v":""},null,null,null,null,null,null,null,{"$f":"IF(B530=\"\",0,IF(B530=B529,COUNTIF(B$9:B529,B530)+1,1))","v":518},0,0]
["523","-1900","-1900-519",null,null,null,null,null,null,null,null,null,null,null,null,null,null,null,null,null,null,{"$f":"IF(M$1019=1,\"\",IF(U531=\"\",\"\",VLOOKUP(U531,Tabelle!$B$4:$O$6,14,FALSE)))","v":""},{"$f":"IF(M$1019=1,\"\",IF(U531=\"\",\"\",VLOOKUP(U531,Tabelle!$B$4:$Q$6,16,FALSE)))","v":""},null,null,null,null,null,null,null,{"$f":"IF(B531=\"\",0,IF(B531=B530,COUNTIF(B$9:B530,B531)+1,1))","v":519},0,0]
["524","-1900","-1900-520",null,null,null,null,null,null,null,null,null,null,null,null,null,null,null,null,null,null,{"$f":"IF(M$1019=1,\"\",IF(U532=\"\",\"\",VLOOKUP(U532,Tabelle!$B$4:$O$6,14,FALSE)))","v":""},{"$f":"IF(M$1019=1,\"\",IF(U532=\"\",\"\",VLOOKUP(U532,Tabelle!$B$4:$Q$6,16,FALSE)))","v":""},null,null,null,null,null,null,null,{"$f":"IF(B532=\"\",0,IF(B532=B531,COUNTIF(B$9:B531,B532)+1,1))","v":520},{"$f":"IF(OR(D532=\"\",M$1019=1),0,IF(AE532=8,1,0))","v":0},0]
["525","-1900","-1900-521",null,null,null,null,null,null,null,null,null,null,null,null,null,null,null,null,null,null,{"$f":"IF(M$1019=1,\"\",IF(U533=\"\",\"\",VLOOKUP(U533,Tabelle!$B$4:$O$6,14,FALSE)))","v":""},{"$f":"IF(M$1019=1,\"\",IF(U533=\"\",\"\",VLOOKUP(U533,Tabelle!$B$4:$Q$6,16,FALSE)))","v":""},null,null,null,null,null,null,null,{"$f":"IF(B533=\"\",0,IF(B533=B532,COUNTIF(B$9:B532,B533)+1,1))","v":521},0,0]
["526","-1900","-1900-522",null,null,null,null,null,null,null,null,null,null,null,null,null,null,null,null,null,null,{"$f":"IF(M$1019=1,\"\",IF(U534=\"\",\"\",VLOOKUP(U534,Tabelle!$B$4:$O$6,14,FALSE)))","v":""},{"$f":"IF(M$1019=1,\"\",IF(U534=\"\",\"\",VLOOKUP(U534,Tabelle!$B$4:$Q$6,16,FALSE)))","v":""},null,null,null,null,null,null,null,{"$f":"IF(B534=\"\",0,IF(B534=B533,COUNTIF(B$9:B533,B534)+1,1))","v":522},0,0]
["527","-1900","-1900-523",null,null,null,null,null,null,null,null,null,null,null,null,null,null,null,null,null,null,{"$f":"IF(M$1019=1,\"\",IF(U535=\"\",\"\",VLOOKUP(U535,Tabelle!$B$4:$O$6,14,FALSE)))","v":""},{"$f":"IF(M$1019=1,\"\",IF(U535=\"\",\"\",VLOOKUP(U535,Tabelle!$B$4:$Q$6,16,FALSE)))","v":""},null,null,null,null,null,null,null,{"$f":"IF(B535=\"\",0,IF(B535=B534,COUNTIF(B$9:B534,B535)+1,1))","v":523},0,0]
["528","-1900","-1900-524",null,null,null,null,null,null,null,null,null,null,null,null,null,null,null,null,null,null,{"$f":"IF(M$1019=1,\"\",IF(U536=\"\",\"\",VLOOKUP(U536,Tabelle!$B$4:$O$6,14,FALSE)))","v":""},{"$f":"IF(M$1019=1,\"\",IF(U536=\"\",\"\",VLOOKUP(U536,Tabelle!$B$4:$Q$6,16,FALSE)))","v":""},null,null,null,null,null,null,null,{"$f":"IF(B536=\"\",0,IF(B536=B535,COUNTIF(B$9:B535,B536)+1,1))","v":524},0,0]
["529","-1900","-1900-525",null,null,null,null,null,null,null,null,null,null,null,null,null,null,null,null,null,null,{"$f":"IF(M$1019=1,\"\",IF(U537=\"\",\"\",VLOOKUP(U537,Tabelle!$B$4:$O$6,14,FALSE)))","v":""},{"$f":"IF(M$1019=1,\"\",IF(U537=\"\",\"\",VLOOKUP(U537,Tabelle!$B$4:$Q$6,16,FALSE)))","v":""},null,null,null,null,null,null,null,{"$f":"IF(B537=\"\",0,IF(B537=B536,COUNTIF(B$9:B536,B537)+1,1))","v":525},0,0]
["530","-1900","-1900-526",null,null,null,null,null,null,null,null,null,null,null,null,null,null,null,null,null,null,{"$f":"IF(M$1019=1,\"\",IF(U538=\"\",\"\",VLOOKUP(U538,Tabelle!$B$4:$O$6,14,FALSE)))","v":""},{"$f":"IF(M$1019=1,\"\",IF(U538=\"\",\"\",VLOOKUP(U538,Tabelle!$B$4:$Q$6,16,FALSE)))","v":""},null,null,null,null,null,null,null,{"$f":"IF(B538=\"\",0,IF(B538=B537,COUNTIF(B$9:B537,B538)+1,1))","v":526},0,0]
["531","-1900","-1900-527",null,null,null,null,null,null,null,null,null,null,null,null,null,null,null,null,null,null,{"$f":"IF(M$1019=1,\"\",IF(U539=\"\",\"\",VLOOKUP(U539,Tabelle!$B$4:$O$6,14,FALSE)))","v":""},{"$f":"IF(M$1019=1,\"\",IF(U539=\"\",\"\",VLOOKUP(U539,Tabelle!$B$4:$Q$6,16,FALSE)))","v":""},null,null,null,null,null,null,null,{"$f":"IF(B539=\"\",0,IF(B539=B538,COUNTIF(B$9:B538,B539)+1,1))","v":527},0,0]
["532","-1900","-1900-528",null,null,null,null,null,null,null,null,null,null,null,null,null,null,null,null,null,null,{"$f":"IF(M$1019=1,\"\",IF(U540=\"\",\"\",VLOOKUP(U540,Tabelle!$B$4:$O$6,14,FALSE)))","v":""},{"$f":"IF(M$1019=1,\"\",IF(U540=\"\",\"\",VLOOKUP(U540,Tabelle!$B$4:$Q$6,16,FALSE)))","v":""},null,null,null,null,null,null,null,{"$f":"IF(B540=\"\",0,IF(B540=B539,COUNTIF(B$9:B539,B540)+1,1))","v":528},0,0]
["533","-1900","-1900-529",null,null,null,null,null,null,null,null,null,null,null,null,null,null,null,null,null,null,{"$f":"IF(M$1019=1,\"\",IF(U541=\"\",\"\",VLOOKUP(U541,Tabelle!$B$4:$O$6,14,FALSE)))","v":""},{"$f":"IF(M$1019=1,\"\",IF(U541=\"\",\"\",VLOOKUP(U541,Tabelle!$B$4:$Q$6,16,FALSE)))","v":""},null,null,null,null,null,null,null,{"$f":"IF(B541=\"\",0,IF(B541=B540,COUNTIF(B$9:B540,B541)+1,1))","v":529},0,0]
["534","-1900","-1900-530",null,null,null,null,null,null,null,null,null,null,null,null,null,null,null,null,null,null,{"$f":"IF(M$1019=1,\"\",IF(U542=\"\",\"\",VLOOKUP(U542,Tabelle!$B$4:$O$6,14,FALSE)))","v":""},{"$f":"IF(M$1019=1,\"\",IF(U542=\"\",\"\",VLOOKUP(U542,Tabelle!$B$4:$Q$6,16,FALSE)))","v":""},null,null,null,null,null,null,null,{"$f":"IF(B542=\"\",0,IF(B542=B541,COUNTIF(B$9:B541,B542)+1,1))","v":530},0,0]
["535","-1900","-1900-531",null,null,null,null,null,null,null,null,null,null,null,null,null,null,null,null,null,null,{"$f":"IF(M$1019=1,\"\",IF(U543=\"\",\"\",VLOOKUP(U543,Tabelle!$B$4:$O$6,14,FALSE)))","v":""},{"$f":"IF(M$1019=1,\"\",IF(U543=\"\",\"\",VLOOKUP(U543,Tabelle!$B$4:$Q$6,16,FALSE)))","v":""},null,null,null,null,null,null,null,{"$f":"IF(B543=\"\",0,IF(B543=B542,COUNTIF(B$9:B542,B543)+1,1))","v":531},0,0]
["536","-1900","-1900-532",null,null,null,null,null,null,null,null,null,null,null,null,null,null,null,null,null,null,{"$f":"IF(M$1019=1,\"\",IF(U544=\"\",\"\",VLOOKUP(U544,Tabelle!$B$4:$O$6,14,FALSE)))","v":""},{"$f":"IF(M$1019=1,\"\",IF(U544=\"\",\"\",VLOOKUP(U544,Tabelle!$B$4:$Q$6,16,FALSE)))","v":""},null,null,null,null,null,null,null,{"$f":"IF(B544=\"\",0,IF(B544=B543,COUNTIF(B$9:B543,B544)+1,1))","v":532},0,0]
["537","-1900","-1900-533",null,null,null,null,null,null,null,null,null,null,null,null,null,null,null,null,null,null,{"$f":"IF(M$1019=1,\"\",IF(U545=\"\",\"\",VLOOKUP(U545,Tabelle!$B$4:$O$6,14,FALSE)))","v":""},{"$f":"IF(M$1019=1,\"\",IF(U545=\"\",\"\",VLOOKUP(U545,Tabelle!$B$4:$Q$6,16,FALSE)))","v":""},null,null,null,null,null,null,null,{"$f":"IF(B545=\"\",0,IF(B545=B544,COUNTIF(B$9:B544,B545)+1,1))","v":533},0,0]
["538","-1900","-1900-534",null,null,null,null,null,null,null,null,null,null,null,null,null,null,null,null,null,null,{"$f":"IF(M$1019=1,\"\",IF(U546=\"\",\"\",VLOOKUP(U546,Tabelle!$B$4:$O$6,14,FALSE)))","v":""},{"$f":"IF(M$1019=1,\"\",IF(U546=\"\",\"\",VLOOKUP(U546,Tabelle!$B$4:$Q$6,16,FALSE)))","v":""},null,null,null,null,null,null,null,{"$f":"IF(B546=\"\",0,IF(B546=B545,COUNTIF(B$9:B545,B546)+1,1))","v":534},0,0]
["539","-1900","-1900-535",null,null,null,null,null,null,null,null,null,null,null,null,null,null,null,null,null,null,{"$f":"IF(M$1019=1,\"\",IF(U547=\"\",\"\",VLOOKUP(U547,Tabelle!$B$4:$O$6,14,FALSE)))","v":""},{"$f":"IF(M$1019=1,\"\",IF(U547=\"\",\"\",VLOOKUP(U547,Tabelle!$B$4:$Q$6,16,FALSE)))","v":""},null,null,null,null,null,null,null,{"$f":"IF(B547=\"\",0,IF(B547=B546,COUNTIF(B$9:B546,B547)+1,1))","v":535},0,0]
["540","-1900","-1900-536",null,null,null,null,null,null,null,null,null,null,null,null,null,null,null,null,null,null,{"$f":"IF(M$1019=1,\"\",IF(U548=\"\",\"\",VLOOKUP(U548,Tabelle!$B$4:$O$6,14,FALSE)))","v":""},{"$f":"IF(M$1019=1,\"\",IF(U548=\"\",\"\",VLOOKUP(U548,Tabelle!$B$4:$Q$6,16,FALSE)))","v":""},null,null,null,null,null,null,null,{"$f":"IF(B548=\"\",0,IF(B548=B547,COUNTIF(B$9:B547,B548)+1,1))","v":536},0,0]
["541","-1900","-1900-537",null,null,null,null,null,null,null,null,null,null,null,null,null,null,null,null,null,null,{"$f":"IF(M$1019=1,\"\",IF(U549=\"\",\"\",VLOOKUP(U549,Tabelle!$B$4:$O$6,14,FALSE)))","v":""},{"$f":"IF(M$1019=1,\"\",IF(U549=\"\",\"\",VLOOKUP(U549,Tabelle!$B$4:$Q$6,16,FALSE)))","v":""},null,null,null,null,null,null,null,{"$f":"IF(B549=\"\",0,IF(B549=B548,COUNTIF(B$9:B548,B549)+1,1))","v":537},0,0]
["542","-1900","-1900-538",null,null,null,null,null,null,null,null,null,null,null,null,null,null,null,null,null,null,{"$f":"IF(M$1019=1,\"\",IF(U550=\"\",\"\",VLOOKUP(U550,Tabelle!$B$4:$O$6,14,FALSE)))","v":""},{"$f":"IF(M$1019=1,\"\",IF(U550=\"\",\"\",VLOOKUP(U550,Tabelle!$B$4:$Q$6,16,FALSE)))","v":""},null,null,null,null,null,null,null,{"$f":"IF(B550=\"\",0,IF(B550=B549,COUNTIF(B$9:B549,B550)+1,1))","v":538},0,0]
["543","-1900","-1900-539",null,null,null,null,null,null,null,null,null,null,null,null,null,null,null,null,null,null,{"$f":"IF(M$1019=1,\"\",IF(U551=\"\",\"\",VLOOKUP(U551,Tabelle!$B$4:$O$6,14,FALSE)))","v":""},{"$f":"IF(M$1019=1,\"\",IF(U551=\"\",\"\",VLOOKUP(U551,Tabelle!$B$4:$Q$6,16,FALSE)))","v":""},null,null,null,null,null,null,null,{"$f":"IF(B551=\"\",0,IF(B551=B550,COUNTIF(B$9:B550,B551)+1,1))","v":539},0,0]
["544","-1900","-1900-540",null,null,null,null,null,null,null,null,null,null,null,null,null,null,null,null,null,null,{"$f":"IF(M$1019=1,\"\",IF(U552=\"\",\"\",VLOOKUP(U552,Tabelle!$B$4:$O$6,14,FALSE)))","v":""},{"$f":"IF(M$1019=1,\"\",IF(U552=\"\",\"\",VLOOKUP(U552,Tabelle!$B$4:$Q$6,16,FALSE)))","v":""},null,null,null,null,null,null,null,{"$f":"IF(B552=\"\",0,IF(B552=B551,COUNTIF(B$9:B551,B552)+1,1))","v":540},0,0]
["545","-1900","-1900-541",null,null,null,null,null,null,null,null,null,null,null,null,null,null,null,null,null,null,{"$f":"IF(M$1019=1,\"\",IF(U553=\"\",\"\",VLOOKUP(U553,Tabelle!$B$4:$O$6,14,FALSE)))","v":""},{"$f":"IF(M$1019=1,\"\",IF(U553=\"\",\"\",VLOOKUP(U553,Tabelle!$B$4:$Q$6,16,FALSE)))","v":""},null,null,null,null,null,null,null,{"$f":"IF(B553=\"\",0,IF(B553=B552,COUNTIF(B$9:B552,B553)+1,1))","v":541},0,0]
["546","-1900","-1900-542",null,null,null,null,null,null,null,null,null,null,null,null,null,null,null,null,null,null,{"$f":"IF(M$1019=1,\"\",IF(U554=\"\",\"\",VLOOKUP(U554,Tabelle!$B$4:$O$6,14,FALSE)))","v":""},{"$f":"IF(M$1019=1,\"\",IF(U554=\"\",\"\",VLOOKUP(U554,Tabelle!$B$4:$Q$6,16,FALSE)))","v":""},null,null,null,null,null,null,null,{"$f":"IF(B554=\"\",0,IF(B554=B553,COUNTIF(B$9:B553,B554)+1,1))","v":542},0,0]
["547","-1900","-1900-543",null,null,null,null,null,null,null,null,null,null,null,null,null,null,null,null,null,null,{"$f":"IF(M$1019=1,\"\",IF(U555=\"\",\"\",VLOOKUP(U555,Tabelle!$B$4:$O$6,14,FALSE)))","v":""},{"$f":"IF(M$1019=1,\"\",IF(U555=\"\",\"\",VLOOKUP(U555,Tabelle!$B$4:$Q$6,16,FALSE)))","v":""},null,null,null,null,null,null,null,{"$f":"IF(B555=\"\",0,IF(B555=B554,COUNTIF(B$9:B554,B555)+1,1))","v":543},0,0]
["548","-1900","-1900-544",null,null,null,null,null,null,null,null,null,null,null,null,null,null,null,null,null,null,{"$f":"IF(M$1019=1,\"\",IF(U556=\"\",\"\",VLOOKUP(U556,Tabelle!$B$4:$O$6,14,FALSE)))","v":""},{"$f":"IF(M$1019=1,\"\",IF(U556=\"\",\"\",VLOOKUP(U556,Tabelle!$B$4:$Q$6,16,FALSE)))","v":""},null,null,null,null,null,null,null,{"$f":"IF(B556=\"\",0,IF(B556=B555,COUNTIF(B$9:B555,B556)+1,1))","v":544},0,0]
["549","-1900","-1900-545",null,null,null,null,null,null,null,null,null,null,null,null,null,null,null,null,null,null,{"$f":"IF(M$1019=1,\"\",IF(U557=\"\",\"\",VLOOKUP(U557,Tabelle!$B$4:$O$6,14,FALSE)))","v":""},{"$f":"IF(M$1019=1,\"\",IF(U557=\"\",\"\",VLOOKUP(U557,Tabelle!$B$4:$Q$6,16,FALSE)))","v":""},null,null,null,null,null,null,null,{"$f":"IF(B557=\"\",0,IF(B557=B556,COUNTIF(B$9:B556,B557)+1,1))","v":545},0,0]
["550","-1900","-1900-546",null,null,null,null,null,null,null,null,null,null,null,null,null,null,null,null,null,null,{"$f":"IF(M$1019=1,\"\",IF(U558=\"\",\"\",VLOOKUP(U558,Tabelle!$B$4:$O$6,14,FALSE)))","v":""},{"$f":"IF(M$1019=1,\"\",IF(U558=\"\",\"\",VLOOKUP(U558,Tabelle!$B$4:$Q$6,16,FALSE)))","v":""},null,null,null,null,null,null,null,{"$f":"IF(B558=\"\",0,IF(B558=B557,COUNTIF(B$9:B557,B558)+1,1))","v":546},0,0]
["551","-1900","-1900-547",null,null,null,null,null,null,null,null,null,null,null,null,null,null,null,null,null,null,{"$f":"IF(M$1019=1,\"\",IF(U559=\"\",\"\",VLOOKUP(U559,Tabelle!$B$4:$O$6,14,FALSE)))","v":""},{"$f":"IF(M$1019=1,\"\",IF(U559=\"\",\"\",VLOOKUP(U559,Tabelle!$B$4:$Q$6,16,FALSE)))","v":""},null,null,null,null,null,null,null,{"$f":"IF(B559=\"\",0,IF(B559=B558,COUNTIF(B$9:B558,B559)+1,1))","v":547},0,0]
["552","-1900","-1900-548",null,null,null,null,null,null,null,null,null,null,null,null,null,null,null,null,null,null,{"$f":"IF(M$1019=1,\"\",IF(U560=\"\",\"\",VLOOKUP(U560,Tabelle!$B$4:$O$6,14,FALSE)))","v":""},{"$f":"IF(M$1019=1,\"\",IF(U560=\"\",\"\",VLOOKUP(U560,Tabelle!$B$4:$Q$6,16,FALSE)))","v":""},null,null,null,null,null,null,null,{"$f":"IF(B560=\"\",0,IF(B560=B559,COUNTIF(B$9:B559,B560)+1,1))","v":548},0,0]
["553","-1900","-1900-549",null,null,null,null,null,null,null,null,null,null,null,null,null,null,null,null,null,null,{"$f":"IF(M$1019=1,\"\",IF(U561=\"\",\"\",VLOOKUP(U561,Tabelle!$B$4:$O$6,14,FALSE)))","v":""},{"$f":"IF(M$1019=1,\"\",IF(U561=\"\",\"\",VLOOKUP(U561,Tabelle!$B$4:$Q$6,16,FALSE)))","v":""},null,null,null,null,null,null,null,{"$f":"IF(B561=\"\",0,IF(B561=B560,COUNTIF(B$9:B560,B561)+1,1))","v":549},0,0]
["554","-1900","-1900-550",null,null,null,null,null,null,null,null,null,null,null,null,null,null,null,null,null,null,{"$f":"IF(M$1019=1,\"\",IF(U562=\"\",\"\",VLOOKUP(U562,Tabelle!$B$4:$O$6,14,FALSE)))","v":""},{"$f":"IF(M$1019=1,\"\",IF(U562=\"\",\"\",VLOOKUP(U562,Tabelle!$B$4:$Q$6,16,FALSE)))","v":""},null,null,null,null,null,null,null,{"$f":"IF(B562=\"\",0,IF(B562=B561,COUNTIF(B$9:B561,B562)+1,1))","v":550},0,0]
["555","-1900",{"$f":"IF(M$1019=1,0,B563&\"-\"&AE563)","v":"-1900-551"},null,null,null,null,null,null,null,null,null,null,null,null,null,null,null,null,null,null,{"$f":"IF(M$1019=1,\"\",IF(U563=\"\",\"\",VLOOKUP(U563,Tabelle!$B$4:$O$6,14,FALSE)))","v":""},{"$f":"IF(M$1019=1,\"\",IF(U563=\"\",\"\",VLOOKUP(U563,Tabelle!$B$4:$Q$6,16,FALSE)))","v":""},null,null,null,null,null,null,null,{"$f":"IF(B563=\"\",0,IF(B563=B562,COUNTIF(B$9:B562,B563)+1,1))","v":551},0,0]
["556","-1900","-1900-552",null,null,null,null,null,null,null,null,null,null,null,null,null,null,null,null,null,null,{"$f":"IF(M$1019=1,\"\",IF(U564=\"\",\"\",VLOOKUP(U564,Tabelle!$B$4:$O$6,14,FALSE)))","v":""},{"$f":"IF(M$1019=1,\"\",IF(U564=\"\",\"\",VLOOKUP(U564,Tabelle!$B$4:$Q$6,16,FALSE)))","v":""},null,null,null,null,null,null,null,{"$f":"IF(B564=\"\",0,IF(B564=B563,COUNTIF(B$9:B563,B564)+1,1))","v":552},0,0]
["557","-1900","-1900-553",null,null,null,null,null,null,null,null,null,null,null,null,null,null,null,null,null,null,{"$f":"IF(M$1019=1,\"\",IF(U565=\"\",\"\",VLOOKUP(U565,Tabelle!$B$4:$O$6,14,FALSE)))","v":""},{"$f":"IF(M$1019=1,\"\",IF(U565=\"\",\"\",VLOOKUP(U565,Tabelle!$B$4:$Q$6,16,FALSE)))","v":""},null,null,null,null,null,null,null,{"$f":"IF(B565=\"\",0,IF(B565=B564,COUNTIF(B$9:B564,B565)+1,1))","v":553},0,0]
["558","-1900","-1900-554",null,null,null,null,null,null,null,null,null,null,null,null,null,null,null,null,null,null,{"$f":"IF(M$1019=1,\"\",IF(U566=\"\",\"\",VLOOKUP(U566,Tabelle!$B$4:$O$6,14,FALSE)))","v":""},{"$f":"IF(M$1019=1,\"\",IF(U566=\"\",\"\",VLOOKUP(U566,Tabelle!$B$4:$Q$6,16,FALSE)))","v":""},null,null,null,null,null,null,null,{"$f":"IF(B566=\"\",0,IF(B566=B565,COUNTIF(B$9:B565,B566)+1,1))","v":554},0,0]
["559","-1900","-1900-555",null,null,null,null,null,null,null,null,null,null,null,null,null,null,null,null,null,null,{"$f":"IF(M$1019=1,\"\",IF(U567=\"\",\"\",VLOOKUP(U567,Tabelle!$B$4:$O$6,14,FALSE)))","v":""},{"$f":"IF(M$1019=1,\"\",IF(U567=\"\",\"\",VLOOKUP(U567,Tabelle!$B$4:$Q$6,16,FALSE)))","v":""},null,null,null,null,null,null,null,{"$f":"IF(B567=\"\",0,IF(B567=B566,COUNTIF(B$9:B566,B567)+1,1))","v":555},0,0]
["560","-1900","-1900-556",null,null,null,null,null,null,null,null,null,null,null,null,null,null,null,null,null,null,{"$f":"IF(M$1019=1,\"\",IF(U568=\"\",\"\",VLOOKUP(U568,Tabelle!$B$4:$O$6,14,FALSE)))","v":""},{"$f":"IF(M$1019=1,\"\",IF(U568=\"\",\"\",VLOOKUP(U568,Tabelle!$B$4:$Q$6,16,FALSE)))","v":""},null,null,null,null,null,null,null,{"$f":"IF(B568=\"\",0,IF(B568=B567,COUNTIF(B$9:B567,B568)+1,1))","v":556},0,0]
["561","-1900","-1900-557",null,null,null,null,null,null,null,null,null,null,null,null,null,null,null,null,null,null,{"$f":"IF(M$1019=1,\"\",IF(U569=\"\",\"\",VLOOKUP(U569,Tabelle!$B$4:$O$6,14,FALSE)))","v":""},{"$f":"IF(M$1019=1,\"\",IF(U569=\"\",\"\",VLOOKUP(U569,Tabelle!$B$4:$Q$6,16,FALSE)))","v":""},null,null,null,null,null,null,null,{"$f":"IF(B569=\"\",0,IF(B569=B568,COUNTIF(B$9:B568,B569)+1,1))","v":557},0,0]
["562","-1900","-1900-558",null,null,null,null,null,null,null,null,null,null,null,null,null,null,null,null,null,null,{"$f":"IF(M$1019=1,\"\",IF(U570=\"\",\"\",VLOOKUP(U570,Tabelle!$B$4:$O$6,14,FALSE)))","v":""},{"$f":"IF(M$1019=1,\"\",IF(U570=\"\",\"\",VLOOKUP(U570,Tabelle!$B$4:$Q$6,16,FALSE)))","v":""},null,null,null,null,null,null,null,{"$f":"IF(B570=\"\",0,IF(B570=B569,COUNTIF(B$9:B569,B570)+1,1))","v":558},0,0]
["563","-1900","-1900-559",null,null,null,null,null,null,null,null,null,null,null,null,null,null,null,null,null,null,{"$f":"IF(M$1019=1,\"\",IF(U571=\"\",\"\",VLOOKUP(U571,Tabelle!$B$4:$O$6,14,FALSE)))","v":""},{"$f":"IF(M$1019=1,\"\",IF(U571=\"\",\"\",VLOOKUP(U571,Tabelle!$B$4:$Q$6,16,FALSE)))","v":""},null,null,null,null,null,null,null,{"$f":"IF(B571=\"\",0,IF(B571=B570,COUNTIF(B$9:B570,B571)+1,1))","v":559},0,0]
["564","-1900","-1900-560",null,null,null,null,null,null,null,null,null,null,null,null,null,null,null,null,null,null,{"$f":"IF(M$1019=1,\"\",IF(U572=\"\",\"\",VLOOKUP(U572,Tabelle!$B$4:$O$6,14,FALSE)))","v":""},{"$f":"IF(M$1019=1,\"\",IF(U572=\"\",\"\",VLOOKUP(U572,Tabelle!$B$4:$Q$6,16,FALSE)))","v":""},null,null,null,null,null,null,null,{"$f":"IF(B572=\"\",0,IF(B572=B571,COUNTIF(B$9:B571,B572)+1,1))","v":560},0,0]
["565","-1900","-1900-561",null,null,null,null,null,null,null,null,null,null,null,null,null,null,null,null,null,null,{"$f":"IF(M$1019=1,\"\",IF(U573=\"\",\"\",VLOOKUP(U573,Tabelle!$B$4:$O$6,14,FALSE)))","v":""},{"$f":"IF(M$1019=1,\"\",IF(U573=\"\",\"\",VLOOKUP(U573,Tabelle!$B$4:$Q$6,16,FALSE)))","v":""},null,null,null,null,null,null,null,{"$f":"IF(B573=\"\",0,IF(B573=B572,COUNTIF(B$9:B572,B573)+1,1))","v":561},0,0]
["566","-1900","-1900-562",null,null,null,null,null,null,null,null,null,null,null,null,null,null,null,null,null,null,{"$f":"IF(M$1019=1,\"\",IF(U574=\"\",\"\",VLOOKUP(U574,Tabelle!$B$4:$O$6,14,FALSE)))","v":""},{"$f":"IF(M$1019=1,\"\",IF(U574=\"\",\"\",VLOOKUP(U574,Tabelle!$B$4:$Q$6,16,FALSE)))","v":""},null,null,null,null,null,null,null,{"$f":"IF(B574=\"\",0,IF(B574=B573,COUNTIF(B$9:B573,B574)+1,1))","v":562},0,0]
["567","-1900","-1900-563",null,null,null,null,null,null,null,null,null,null,null,null,null,null,null,null,null,null,{"$f":"IF(M$1019=1,\"\",IF(U575=\"\",\"\",VLOOKUP(U575,Tabelle!$B$4:$O$6,14,FALSE)))","v":""},{"$f":"IF(M$1019=1,\"\",IF(U575=\"\",\"\",VLOOKUP(U575,Tabelle!$B$4:$Q$6,16,FALSE)))","v":""},null,null,null,null,null,null,null,{"$f":"IF(B575=\"\",0,IF(B575=B574,COUNTIF(B$9:B574,B575)+1,1))","v":563},0,0]
["568","-1900","-1900-564",null,null,null,null,null,null,null,null,null,null,null,null,null,null,null,null,null,null,{"$f":"IF(M$1019=1,\"\",IF(U576=\"\",\"\",VLOOKUP(U576,Tabelle!$B$4:$O$6,14,FALSE)))","v":""},{"$f":"IF(M$1019=1,\"\",IF(U576=\"\",\"\",VLOOKUP(U576,Tabelle!$B$4:$Q$6,16,FALSE)))","v":""},null,null,null,null,null,null,null,{"$f":"IF(B576=\"\",0,IF(B576=B575,COUNTIF(B$9:B575,B576)+1,1))","v":564},0,0]
["569","-1900","-1900-565",null,null,null,null,null,null,null,null,null,null,null,null,null,null,null,null,null,null,{"$f":"IF(M$1019=1,\"\",IF(U577=\"\",\"\",VLOOKUP(U577,Tabelle!$B$4:$O$6,14,FALSE)))","v":""},{"$f":"IF(M$1019=1,\"\",IF(U577=\"\",\"\",VLOOKUP(U577,Tabelle!$B$4:$Q$6,16,FALSE)))","v":""},null,null,null,null,null,null,null,{"$f":"IF(B577=\"\",0,IF(B577=B576,COUNTIF(B$9:B576,B577)+1,1))","v":565},0,0]
["570","-1900","-1900-566",null,null,null,null,null,null,null,null,null,null,null,null,null,null,null,null,null,null,{"$f":"IF(M$1019=1,\"\",IF(U578=\"\",\"\",VLOOKUP(U578,Tabelle!$B$4:$O$6,14,FALSE)))","v":""},{"$f":"IF(M$1019=1,\"\",IF(U578=\"\",\"\",VLOOKUP(U578,Tabelle!$B$4:$Q$6,16,FALSE)))","v":""},null,null,null,null,null,null,null,{"$f":"IF(B578=\"\",0,IF(B578=B577,COUNTIF(B$9:B577,B578)+1,1))","v":566},0,0]
["571","-1900","-1900-567",null,null,null,null,null,null,null,null,null,null,null,null,null,null,null,null,null,null,{"$f":"IF(M$1019=1,\"\",IF(U579=\"\",\"\",VLOOKUP(U579,Tabelle!$B$4:$O$6,14,FALSE)))","v":""},{"$f":"IF(M$1019=1,\"\",IF(U579=\"\",\"\",VLOOKUP(U579,Tabelle!$B$4:$Q$6,16,FALSE)))","v":""},null,null,null,null,null,null,null,{"$f":"IF(B579=\"\",0,IF(B579=B578,COUNTIF(B$9:B578,B579)+1,1))","v":567},0,0]
["572","-1900","-1900-568",null,null,null,null,null,null,null,null,null,null,null,null,null,null,null,null,null,null,{"$f":"IF(M$1019=1,\"\",IF(U580=\"\",\"\",VLOOKUP(U580,Tabelle!$B$4:$O$6,14,FALSE)))","v":""},{"$f":"IF(M$1019=1,\"\",IF(U580=\"\",\"\",VLOOKUP(U580,Tabelle!$B$4:$Q$6,16,FALSE)))","v":""},null,null,null,null,null,null,null,{"$f":"IF(B580=\"\",0,IF(B580=B579,COUNTIF(B$9:B579,B580)+1,1))","v":568},0,0]
["573","-1900","-1900-569",null,null,null,null,null,null,null,null,null,null,null,null,null,null,null,null,null,null,{"$f":"IF(M$1019=1,\"\",IF(U581=\"\",\"\",VLOOKUP(U581,Tabelle!$B$4:$O$6,14,FALSE)))","v":""},{"$f":"IF(M$1019=1,\"\",IF(U581=\"\",\"\",VLOOKUP(U581,Tabelle!$B$4:$Q$6,16,FALSE)))","v":""},null,null,null,null,null,null,null,{"$f":"IF(B581=\"\",0,IF(B581=B580,COUNTIF(B$9:B580,B581)+1,1))","v":569},0,0]
["574","-1900","-1900-570",null,null,null,null,null,null,null,null,null,null,null,null,null,null,null,null,null,null,{"$f":"IF(M$1019=1,\"\",IF(U582=\"\",\"\",VLOOKUP(U582,Tabelle!$B$4:$O$6,14,FALSE)))","v":""},{"$f":"IF(M$1019=1,\"\",IF(U582=\"\",\"\",VLOOKUP(U582,Tabelle!$B$4:$Q$6,16,FALSE)))","v":""},null,null,null,null,null,null,null,{"$f":"IF(B582=\"\",0,IF(B582=B581,COUNTIF(B$9:B581,B582)+1,1))","v":570},0,0]
["575","-1900","-1900-571",null,null,null,null,null,null,null,null,null,null,null,null,null,null,null,null,null,null,{"$f":"IF(M$1019=1,\"\",IF(U583=\"\",\"\",VLOOKUP(U583,Tabelle!$B$4:$O$6,14,FALSE)))","v":""},{"$f":"IF(M$1019=1,\"\",IF(U583=\"\",\"\",VLOOKUP(U583,Tabelle!$B$4:$Q$6,16,FALSE)))","v":""},null,null,null,null,null,null,null,{"$f":"IF(B583=\"\",0,IF(B583=B582,COUNTIF(B$9:B582,B583)+1,1))","v":571},0,0]
["576","-1900","-1900-572",null,null,null,null,null,null,null,null,null,null,null,null,null,null,null,null,null,null,{"$f":"IF(M$1019=1,\"\",IF(U584=\"\",\"\",VLOOKUP(U584,Tabelle!$B$4:$O$6,14,FALSE)))","v":""},{"$f":"IF(M$1019=1,\"\",IF(U584=\"\",\"\",VLOOKUP(U584,Tabelle!$B$4:$Q$6,16,FALSE)))","v":""},null,null,null,null,null,null,null,{"$f":"IF(B584=\"\",0,IF(B584=B583,COUNTIF(B$9:B583,B584)+1,1))","v":572},0,0]
["577","-1900","-1900-573",null,null,null,null,null,null,null,null,null,null,null,null,null,null,null,null,null,null,{"$f":"IF(M$1019=1,\"\",IF(U585=\"\",\"\",VLOOKUP(U585,Tabelle!$B$4:$O$6,14,FALSE)))","v":""},{"$f":"IF(M$1019=1,\"\",IF(U585=\"\",\"\",VLOOKUP(U585,Tabelle!$B$4:$Q$6,16,FALSE)))","v":""},null,null,null,null,null,null,null,{"$f":"IF(B585=\"\",0,IF(B585=B584,COUNTIF(B$9:B584,B585)+1,1))","v":573},0,0]
["578",{"$f":"IF(AG586=$AG$1013,0,IF(M$1019=1,0,D586&\"-\"&YEAR(E586)))","v":"-1900"},"-1900-574",null,null,null,null,null,null,null,null,null,null,null,null,null,null,null,null,null,null,{"$f":"IF(M$1019=1,\"\",IF(U586=\"\",\"\",VLOOKUP(U586,Tabelle!$B$4:$O$6,14,FALSE)))","v":""},{"$f":"IF(M$1019=1,\"\",IF(U586=\"\",\"\",VLOOKUP(U586,Tabelle!$B$4:$Q$6,16,FALSE)))","v":""},null,null,null,null,null,null,null,{"$f":"IF(B586=\"\",0,IF(B586=B585,COUNTIF(B$9:B585,B586)+1,1))","v":574},0,{"$f":"IF(E586>0,IF(OR(MONTH(E586)<$L$1030,MONTH(E586)>$L$1031),AG$1013,0),0)","v":0}]
["579","-1900","-1900-575",null,null,null,null,null,null,null,null,null,null,null,null,null,null,null,null,null,null,{"$f":"IF(M$1019=1,\"\",IF(U587=\"\",\"\",VLOOKUP(U587,Tabelle!$B$4:$O$6,14,FALSE)))","v":""},{"$f":"IF(M$1019=1,\"\",IF(U587=\"\",\"\",VLOOKUP(U587,Tabelle!$B$4:$Q$6,16,FALSE)))","v":""},null,null,null,null,null,null,null,{"$f":"IF(B587=\"\",0,IF(B587=B586,COUNTIF(B$9:B586,B587)+1,1))","v":575},0,0]
["580","-1900","-1900-576",null,null,null,null,null,null,null,null,null,null,null,null,null,null,null,null,null,null,{"$f":"IF(M$1019=1,\"\",IF(U588=\"\",\"\",VLOOKUP(U588,Tabelle!$B$4:$O$6,14,FALSE)))","v":""},{"$f":"IF(M$1019=1,\"\",IF(U588=\"\",\"\",VLOOKUP(U588,Tabelle!$B$4:$Q$6,16,FALSE)))","v":""},null,null,null,null,null,null,null,{"$f":"IF(B588=\"\",0,IF(B588=B587,COUNTIF(B$9:B587,B588)+1,1))","v":576},0,0]
["581","-1900","-1900-577",null,null,null,null,null,null,null,null,null,null,null,null,null,null,null,null,null,null,{"$f":"IF(M$1019=1,\"\",IF(U589=\"\",\"\",VLOOKUP(U589,Tabelle!$B$4:$O$6,14,FALSE)))","v":""},{"$f":"IF(M$1019=1,\"\",IF(U589=\"\",\"\",VLOOKUP(U589,Tabelle!$B$4:$Q$6,16,FALSE)))","v":""},null,null,null,null,null,null,null,{"$f":"IF(B589=\"\",0,IF(B589=B588,COUNTIF(B$9:B588,B589)+1,1))","v":577},0,0]
["582","-1900","-1900-578",null,null,null,null,null,null,null,null,null,null,null,null,null,null,null,null,null,null,{"$f":"IF(M$1019=1,\"\",IF(U590=\"\",\"\",VLOOKUP(U590,Tabelle!$B$4:$O$6,14,FALSE)))","v":""},{"$f":"IF(M$1019=1,\"\",IF(U590=\"\",\"\",VLOOKUP(U590,Tabelle!$B$4:$Q$6,16,FALSE)))","v":""},null,null,null,null,null,null,null,{"$f":"IF(B590=\"\",0,IF(B590=B589,COUNTIF(B$9:B589,B590)+1,1))","v":578},0,0]
["583","-1900","-1900-579",null,null,null,null,null,null,null,null,null,null,null,null,null,null,null,null,null,null,{"$f":"IF(M$1019=1,\"\",IF(U591=\"\",\"\",VLOOKUP(U591,Tabelle!$B$4:$O$6,14,FALSE)))","v":""},{"$f":"IF(M$1019=1,\"\",IF(U591=\"\",\"\",VLOOKUP(U591,Tabelle!$B$4:$Q$6,16,FALSE)))","v":""},null,null,null,null,null,null,null,{"$f":"IF(B591=\"\",0,IF(B591=B590,COUNTIF(B$9:B590,B591)+1,1))","v":579},0,0]
["584","-1900","-1900-580",null,null,null,null,null,null,null,null,null,null,null,null,null,null,null,null,null,null,{"$f":"IF(M$1019=1,\"\",IF(U592=\"\",\"\",VLOOKUP(U592,Tabelle!$B$4:$O$6,14,FALSE)))","v":""},{"$f":"IF(M$1019=1,\"\",IF(U592=\"\",\"\",VLOOKUP(U592,Tabelle!$B$4:$Q$6,16,FALSE)))","v":""},null,null,null,null,null,null,null,{"$f":"IF(B592=\"\",0,IF(B592=B591,COUNTIF(B$9:B591,B592)+1,1))","v":580},0,0]
["585","-1900","-1900-581",null,null,null,null,null,null,null,null,null,null,null,null,null,null,null,null,null,null,{"$f":"IF(M$1019=1,\"\",IF(U593=\"\",\"\",VLOOKUP(U593,Tabelle!$B$4:$O$6,14,FALSE)))","v":""},{"$f":"IF(M$1019=1,\"\",IF(U593=\"\",\"\",VLOOKUP(U593,Tabelle!$B$4:$Q$6,16,FALSE)))","v":""},null,null,null,null,null,null,null,{"$f":"IF(B593=\"\",0,IF(B593=B592,COUNTIF(B$9:B592,B593)+1,1))","v":581},0,0]
["586","-1900","-1900-582",null,null,null,null,null,null,null,null,null,null,null,null,null,null,null,null,null,null,{"$f":"IF(M$1019=1,\"\",IF(U594=\"\",\"\",VLOOKUP(U594,Tabelle!$B$4:$O$6,14,FALSE)))","v":""},{"$f":"IF(M$1019=1,\"\",IF(U594=\"\",\"\",VLOOKUP(U594,Tabelle!$B$4:$Q$6,16,FALSE)))","v":""},null,null,null,null,null,null,null,{"$f":"IF(B594=\"\",0,IF(B594=B593,COUNTIF(B$9:B593,B594)+1,1))","v":582},0,0]
["587","-1900","-1900-583",null,null,null,null,null,null,null,null,null,null,null,null,null,null,null,null,null,null,{"$f":"IF(M$1019=1,\"\",IF(U595=\"\",\"\",VLOOKUP(U595,Tabelle!$B$4:$O$6,14,FALSE)))","v":""},{"$f":"IF(M$1019=1,\"\",IF(U595=\"\",\"\",VLOOKUP(U595,Tabelle!$B$4:$Q$6,16,FALSE)))","v":""},null,null,null,null,null,null,null,{"$f":"IF(B595=\"\",0,IF(B595=B594,COUNTIF(B$9:B594,B595)+1,1))","v":583},0,0]
["588","-1900","-1900-584",null,null,null,null,null,null,null,null,null,null,null,null,null,null,null,null,null,null,{"$f":"IF(M$1019=1,\"\",IF(U596=\"\",\"\",VLOOKUP(U596,Tabelle!$B$4:$O$6,14,FALSE)))","v":""},{"$f":"IF(M$1019=1,\"\",IF(U596=\"\",\"\",VLOOKUP(U596,Tabelle!$B$4:$Q$6,16,FALSE)))","v":""},null,null,null,null,null,null,null,{"$f":"IF(B596=\"\",0,IF(B596=B595,COUNTIF(B$9:B595,B596)+1,1))","v":584},{"$f":"IF(OR(D596=\"\",M$1019=1),0,IF(AE596=8,1,0))","v":0},0]
["589","-1900","-1900-585",null,null,null,null,null,null,null,null,null,null,null,null,null,null,null,null,null,null,{"$f":"IF(M$1019=1,\"\",IF(U597=\"\",\"\",VLOOKUP(U597,Tabelle!$B$4:$O$6,14,FALSE)))","v":""},{"$f":"IF(M$1019=1,\"\",IF(U597=\"\",\"\",VLOOKUP(U597,Tabelle!$B$4:$Q$6,16,FALSE)))","v":""},null,null,null,null,null,null,null,{"$f":"IF(B597=\"\",0,IF(B597=B596,COUNTIF(B$9:B596,B597)+1,1))","v":585},0,0]
["590","-1900","-1900-586",null,null,null,null,null,null,null,null,null,null,null,null,null,null,null,null,null,null,{"$f":"IF(M$1019=1,\"\",IF(U598=\"\",\"\",VLOOKUP(U598,Tabelle!$B$4:$O$6,14,FALSE)))","v":""},{"$f":"IF(M$1019=1,\"\",IF(U598=\"\",\"\",VLOOKUP(U598,Tabelle!$B$4:$Q$6,16,FALSE)))","v":""},null,null,null,null,null,null,null,{"$f":"IF(B598=\"\",0,IF(B598=B597,COUNTIF(B$9:B597,B598)+1,1))","v":586},0,0]
["591","-1900","-1900-587",null,null,null,null,null,null,null,null,null,null,null,null,null,null,null,null,null,null,{"$f":"IF(M$1019=1,\"\",IF(U599=\"\",\"\",VLOOKUP(U599,Tabelle!$B$4:$O$6,14,FALSE)))","v":""},{"$f":"IF(M$1019=1,\"\",IF(U599=\"\",\"\",VLOOKUP(U599,Tabelle!$B$4:$Q$6,16,FALSE)))","v":""},null,null,null,null,null,null,null,{"$f":"IF(B599=\"\",0,IF(B599=B598,COUNTIF(B$9:B598,B599)+1,1))","v":587},0,0]
["592","-1900","-1900-588",null,null,null,null,null,null,null,null,null,null,null,null,null,null,null,null,null,null,{"$f":"IF(M$1019=1,\"\",IF(U600=\"\",\"\",VLOOKUP(U600,Tabelle!$B$4:$O$6,14,FALSE)))","v":""},{"$f":"IF(M$1019=1,\"\",IF(U600=\"\",\"\",VLOOKUP(U600,Tabelle!$B$4:$Q$6,16,FALSE)))","v":""},null,null,null,null,null,null,null,{"$f":"IF(B600=\"\",0,IF(B600=B599,COUNTIF(B$9:B599,B600)+1,1))","v":588},0,0]
["593","-1900","-1900-589",null,null,null,null,null,null,null,null,null,null,null,null,null,null,null,null,null,null,{"$f":"IF(M$1019=1,\"\",IF(U601=\"\",\"\",VLOOKUP(U601,Tabelle!$B$4:$O$6,14,FALSE)))","v":""},{"$f":"IF(M$1019=1,\"\",IF(U601=\"\",\"\",VLOOKUP(U601,Tabelle!$B$4:$Q$6,16,FALSE)))","v":""},null,null,null,null,null,null,null,{"$f":"IF(B601=\"\",0,IF(B601=B600,COUNTIF(B$9:B600,B601)+1,1))","v":589},0,0]
["594","-1900","-1900-590",null,null,null,null,null,null,null,null,null,null,null,null,null,null,null,null,null,null,{"$f":"IF(M$1019=1,\"\",IF(U602=\"\",\"\",VLOOKUP(U602,Tabelle!$B$4:$O$6,14,FALSE)))","v":""},{"$f":"IF(M$1019=1,\"\",IF(U602=\"\",\"\",VLOOKUP(U602,Tabelle!$B$4:$Q$6,16,FALSE)))","v":""},null,null,null,null,null,null,null,{"$f":"IF(B602=\"\",0,IF(B602=B601,COUNTIF(B$9:B601,B602)+1,1))","v":590},0,0]
["595","-1900","-1900-591",null,null,null,null,null,null,null,null,null,null,null,null,null,null,null,null,null,null,{"$f":"IF(M$1019=1,\"\",IF(U603=\"\",\"\",VLOOKUP(U603,Tabelle!$B$4:$O$6,14,FALSE)))","v":""},{"$f":"IF(M$1019=1,\"\",IF(U603=\"\",\"\",VLOOKUP(U603,Tabelle!$B$4:$Q$6,16,FALSE)))","v":""},null,null,null,null,null,null,null,{"$f":"IF(B603=\"\",0,IF(B603=B602,COUNTIF(B$9:B602,B603)+1,1))","v":591},0,0]
["596","-1900","-1900-592",null,null,null,null,null,null,null,null,null,null,null,null,null,null,null,null,null,null,{"$f":"IF(M$1019=1,\"\",IF(U604=\"\",\"\",VLOOKUP(U604,Tabelle!$B$4:$O$6,14,FALSE)))","v":""},{"$f":"IF(M$1019=1,\"\",IF(U604=\"\",\"\",VLOOKUP(U604,Tabelle!$B$4:$Q$6,16,FALSE)))","v":""},null,null,null,null,null,null,null,{"$f":"IF(B604=\"\",0,IF(B604=B603,COUNTIF(B$9:B603,B604)+1,1))","v":592},0,0]
["597","-1900","-1900-593",null,null,null,null,null,null,null,null,null,null,null,null,null,null,null,null,null,null,{"$f":"IF(M$1019=1,\"\",IF(U605=\"\",\"\",VLOOKUP(U605,Tabelle!$B$4:$O$6,14,FALSE)))","v":""},{"$f":"IF(M$1019=1,\"\",IF(U605=\"\",\"\",VLOOKUP(U605,Tabelle!$B$4:$Q$6,16,FALSE)))","v":""},null,null,null,null,null,null,null,{"$f":"IF(B605=\"\",0,IF(B605=B604,COUNTIF(B$9:B604,B605)+1,1))","v":593},0,0]
["598","-1900","-1900-594",null,null,null,null,null,null,null,null,null,null,null,null,null,null,null,null,null,null,{"$f":"IF(M$1019=1,\"\",IF(U606=\"\",\"\",VLOOKUP(U606,Tabelle!$B$4:$O$6,14,FALSE)))","v":""},{"$f":"IF(M$1019=1,\"\",IF(U606=\"\",\"\",VLOOKUP(U606,Tabelle!$B$4:$Q$6,16,FALSE)))","v":""},null,null,null,null,null,null,null,{"$f":"IF(B606=\"\",0,IF(B606=B605,COUNTIF(B$9:B605,B606)+1,1))","v":594},0,0]
["599","-1900","-1900-595",null,null,null,null,null,null,null,null,null,null,null,null,null,null,null,null,null,null,{"$f":"IF(M$1019=1,\"\",IF(U607=\"\",\"\",VLOOKUP(U607,Tabelle!$B$4:$O$6,14,FALSE)))","v":""},{"$f":"IF(M$1019=1,\"\",IF(U607=\"\",\"\",VLOOKUP(U607,Tabelle!$B$4:$Q$6,16,FALSE)))","v":""},null,null,null,null,null,null,null,{"$f":"IF(B607=\"\",0,IF(B607=B606,COUNTIF(B$9:B606,B607)+1,1))","v":595},0,0]
["600","-1900","-1900-596",null,null,null,null,null,null,null,null,null,null,null,null,null,null,null,null,null,null,{"$f":"IF(M$1019=1,\"\",IF(U608=\"\",\"\",VLOOKUP(U608,Tabelle!$B$4:$O$6,14,FALSE)))","v":""},{"$f":"IF(M$1019=1,\"\",IF(U608=\"\",\"\",VLOOKUP(U608,Tabelle!$B$4:$Q$6,16,FALSE)))","v":""},null,null,null,null,null,null,null,{"$f":"IF(B608=\"\",0,IF(B608=B607,COUNTIF(B$9:B607,B608)+1,1))","v":596},0,0]
["601","-1900","-1900-597",null,null,null,null,null,null,null,null,null,null,null,null,null,null,null,null,null,null,{"$f":"IF(M$1019=1,\"\",IF(U609=\"\",\"\",VLOOKUP(U609,Tabelle!$B$4:$O$6,14,FALSE)))","v":""},{"$f":"IF(M$1019=1,\"\",IF(U609=\"\",\"\",VLOOKUP(U609,Tabelle!$B$4:$Q$6,16,FALSE)))","v":""},null,null,null,null,null,null,null,{"$f":"IF(B609=\"\",0,IF(B609=B608,COUNTIF(B$9:B608,B609)+1,1))","v":597},0,0]
["602","-1900","-1900-598",null,null,null,null,null,null,null,null,null,null,null,null,null,null,null,null,null,null,{"$f":"IF(M$1019=1,\"\",IF(U610=\"\",\"\",VLOOKUP(U610,Tabelle!$B$4:$O$6,14,FALSE)))","v":""},{"$f":"IF(M$1019=1,\"\",IF(U610=\"\",\"\",VLOOKUP(U610,Tabelle!$B$4:$Q$6,16,FALSE)))","v":""},null,null,null,null,null,null,null,{"$f":"IF(B610=\"\",0,IF(B610=B609,COUNTIF(B$9:B609,B610)+1,1))","v":598},0,0]
["603","-1900","-1900-599",null,null,null,null,null,null,null,null,null,null,null,null,null,null,null,null,null,null,{"$f":"IF(M$1019=1,\"\",IF(U611=\"\",\"\",VLOOKUP(U611,Tabelle!$B$4:$O$6,14,FALSE)))","v":""},{"$f":"IF(M$1019=1,\"\",IF(U611=\"\",\"\",VLOOKUP(U611,Tabelle!$B$4:$Q$6,16,FALSE)))","v":""},null,null,null,null,null,null,null,{"$f":"IF(B611=\"\",0,IF(B611=B610,COUNTIF(B$9:B610,B611)+1,1))","v":599},0,0]
["604","-1900","-1900-600",null,null,null,null,null,null,null,null,null,null,null,null,null,null,null,null,null,null,{"$f":"IF(M$1019=1,\"\",IF(U612=\"\",\"\",VLOOKUP(U612,Tabelle!$B$4:$O$6,14,FALSE)))","v":""},{"$f":"IF(M$1019=1,\"\",IF(U612=\"\",\"\",VLOOKUP(U612,Tabelle!$B$4:$Q$6,16,FALSE)))","v":""},null,null,null,null,null,null,null,{"$f":"IF(B612=\"\",0,IF(B612=B611,COUNTIF(B$9:B611,B612)+1,1))","v":600},0,0]
["605","-1900","-1900-601",null,null,null,null,null,null,null,null,null,null,null,null,null,null,null,null,null,null,{"$f":"IF(M$1019=1,\"\",IF(U613=\"\",\"\",VLOOKUP(U613,Tabelle!$B$4:$O$6,14,FALSE)))","v":""},{"$f":"IF(M$1019=1,\"\",IF(U613=\"\",\"\",VLOOKUP(U613,Tabelle!$B$4:$Q$6,16,FALSE)))","v":""},null,null,null,null,null,null,null,{"$f":"IF(B613=\"\",0,IF(B613=B612,COUNTIF(B$9:B612,B613)+1,1))","v":601},0,0]
["606","-1900","-1900-602",null,null,null,null,null,null,null,null,null,null,null,null,null,null,null,null,null,null,{"$f":"IF(M$1019=1,\"\",IF(U614=\"\",\"\",VLOOKUP(U614,Tabelle!$B$4:$O$6,14,FALSE)))","v":""},{"$f":"IF(M$1019=1,\"\",IF(U614=\"\",\"\",VLOOKUP(U614,Tabelle!$B$4:$Q$6,16,FALSE)))","v":""},null,null,null,null,null,null,null,{"$f":"IF(B614=\"\",0,IF(B614=B613,COUNTIF(B$9:B613,B614)+1,1))","v":602},0,0]
["607","-1900","-1900-603",null,null,null,null,null,null,null,null,null,null,null,null,null,null,null,null,null,null,{"$f":"IF(M$1019=1,\"\",IF(U615=\"\",\"\",VLOOKUP(U615,Tabelle!$B$4:$O$6,14,FALSE)))","v":""},{"$f":"IF(M$1019=1,\"\",IF(U615=\"\",\"\",VLOOKUP(U615,Tabelle!$B$4:$Q$6,16,FALSE)))","v":""},null,null,null,null,null,null,null,{"$f":"IF(B615=\"\",0,IF(B615=B614,COUNTIF(B$9:B614,B615)+1,1))","v":603},0,0]
["608","-1900","-1900-604",null,null,null,null,null,null,null,null,null,null,null,null,null,null,null,null,null,null,{"$f":"IF(M$1019=1,\"\",IF(U616=\"\",\"\",VLOOKUP(U616,Tabelle!$B$4:$O$6,14,FALSE)))","v":""},{"$f":"IF(M$1019=1,\"\",IF(U616=\"\",\"\",VLOOKUP(U616,Tabelle!$B$4:$Q$6,16,FALSE)))","v":""},null,null,null,null,null,null,null,{"$f":"IF(B616=\"\",0,IF(B616=B615,COUNTIF(B$9:B615,B616)+1,1))","v":604},0,0]
["609","-1900","-1900-605",null,null,null,null,null,null,null,null,null,null,null,null,null,null,null,null,null,null,{"$f":"IF(M$1019=1,\"\",IF(U617=\"\",\"\",VLOOKUP(U617,Tabelle!$B$4:$O$6,14,FALSE)))","v":""},{"$f":"IF(M$1019=1,\"\",IF(U617=\"\",\"\",VLOOKUP(U617,Tabelle!$B$4:$Q$6,16,FALSE)))","v":""},null,null,null,null,null,null,null,{"$f":"IF(B617=\"\",0,IF(B617=B616,COUNTIF(B$9:B616,B617)+1,1))","v":605},0,0]
["610","-1900","-1900-606",null,null,null,null,null,null,null,null,null,null,null,null,null,null,null,null,null,null,{"$f":"IF(M$1019=1,\"\",IF(U618=\"\",\"\",VLOOKUP(U618,Tabelle!$B$4:$O$6,14,FALSE)))","v":""},{"$f":"IF(M$1019=1,\"\",IF(U618=\"\",\"\",VLOOKUP(U618,Tabelle!$B$4:$Q$6,16,FALSE)))","v":""},null,null,null,null,null,null,null,{"$f":"IF(B618=\"\",0,IF(B618=B617,COUNTIF(B$9:B617,B618)+1,1))","v":606},0,0]
["611","-1900","-1900-607",null,null,null,null,null,null,null,null,null,null,null,null,null,null,null,null,null,null,{"$f":"IF(M$1019=1,\"\",IF(U619=\"\",\"\",VLOOKUP(U619,Tabelle!$B$4:$O$6,14,FALSE)))","v":""},{"$f":"IF(M$1019=1,\"\",IF(U619=\"\",\"\",VLOOKUP(U619,Tabelle!$B$4:$Q$6,16,FALSE)))","v":""},null,null,null,null,null,null,null,{"$f":"IF(B619=\"\",0,IF(B619=B618,COUNTIF(B$9:B618,B619)+1,1))","v":607},0,0]
["612","-1900","-1900-608",null,null,null,null,null,null,null,null,null,null,null,null,null,null,null,null,null,null,{"$f":"IF(M$1019=1,\"\",IF(U620=\"\",\"\",VLOOKUP(U620,Tabelle!$B$4:$O$6,14,FALSE)))","v":""},{"$f":"IF(M$1019=1,\"\",IF(U620=\"\",\"\",VLOOKUP(U620,Tabelle!$B$4:$Q$6,16,FALSE)))","v":""},null,null,null,null,null,null,null,{"$f":"IF(B620=\"\",0,IF(B620=B619,COUNTIF(B$9:B619,B620)+1,1))","v":608},0,0]
["613","-1900","-1900-609",null,null,null,null,null,null,null,null,null,null,null,null,null,null,null,null,null,null,{"$f":"IF(M$1019=1,\"\",IF(U621=\"\",\"\",VLOOKUP(U621,Tabelle!$B$4:$O$6,14,FALSE)))","v":""},{"$f":"IF(M$1019=1,\"\",IF(U621=\"\",\"\",VLOOKUP(U621,Tabelle!$B$4:$Q$6,16,FALSE)))","v":""},null,null,null,null,null,null,null,{"$f":"IF(B621=\"\",0,IF(B621=B620,COUNTIF(B$9:B620,B621)+1,1))","v":609},0,0]
["614","-1900","-1900-610",null,null,null,null,null,null,null,null,null,null,null,null,null,null,null,null,null,null,{"$f":"IF(M$1019=1,\"\",IF(U622=\"\",\"\",VLOOKUP(U622,Tabelle!$B$4:$O$6,14,FALSE)))","v":""},{"$f":"IF(M$1019=1,\"\",IF(U622=\"\",\"\",VLOOKUP(U622,Tabelle!$B$4:$Q$6,16,FALSE)))","v":""},null,null,null,null,null,null,null,{"$f":"IF(B622=\"\",0,IF(B622=B621,COUNTIF(B$9:B621,B622)+1,1))","v":610},0,0]
["615","-1900","-1900-611",null,null,null,null,null,null,null,null,null,null,null,null,null,null,null,null,null,null,{"$f":"IF(M$1019=1,\"\",IF(U623=\"\",\"\",VLOOKUP(U623,Tabelle!$B$4:$O$6,14,FALSE)))","v":""},{"$f":"IF(M$1019=1,\"\",IF(U623=\"\",\"\",VLOOKUP(U623,Tabelle!$B$4:$Q$6,16,FALSE)))","v":""},null,null,null,null,null,null,null,{"$f":"IF(B623=\"\",0,IF(B623=B622,COUNTIF(B$9:B622,B623)+1,1))","v":611},0,0]
["616","-1900","-1900-612",null,null,null,null,null,null,null,null,null,null,null,null,null,null,null,null,null,null,{"$f":"IF(M$1019=1,\"\",IF(U624=\"\",\"\",VLOOKUP(U624,Tabelle!$B$4:$O$6,14,FALSE)))","v":""},{"$f":"IF(M$1019=1,\"\",IF(U624=\"\",\"\",VLOOKUP(U624,Tabelle!$B$4:$Q$6,16,FALSE)))","v":""},null,null,null,null,null,null,null,{"$f":"IF(B624=\"\",0,IF(B624=B623,COUNTIF(B$9:B623,B624)+1,1))","v":612},0,0]
["617","-1900","-1900-613",null,null,null,null,null,null,null,null,null,null,null,null,null,null,null,null,null,null,{"$f":"IF(M$1019=1,\"\",IF(U625=\"\",\"\",VLOOKUP(U625,Tabelle!$B$4:$O$6,14,FALSE)))","v":""},{"$f":"IF(M$1019=1,\"\",IF(U625=\"\",\"\",VLOOKUP(U625,Tabelle!$B$4:$Q$6,16,FALSE)))","v":""},null,null,null,null,null,null,null,{"$f":"IF(B625=\"\",0,IF(B625=B624,COUNTIF(B$9:B624,B625)+1,1))","v":613},0,0]
["618","-1900","-1900-614",null,null,null,null,null,null,null,null,null,null,null,null,null,null,null,null,null,null,{"$f":"IF(M$1019=1,\"\",IF(U626=\"\",\"\",VLOOKUP(U626,Tabelle!$B$4:$O$6,14,FALSE)))","v":""},{"$f":"IF(M$1019=1,\"\",IF(U626=\"\",\"\",VLOOKUP(U626,Tabelle!$B$4:$Q$6,16,FALSE)))","v":""},null,null,null,null,null,null,null,{"$f":"IF(B626=\"\",0,IF(B626=B625,COUNTIF(B$9:B625,B626)+1,1))","v":614},0,0]
["619","-1900",{"$f":"IF(M$1019=1,0,B627&\"-\"&AE627)","v":"-1900-615"},null,null,null,null,null,null,null,null,null,null,null,null,null,null,null,null,null,null,{"$f":"IF(M$1019=1,\"\",IF(U627=\"\",\"\",VLOOKUP(U627,Tabelle!$B$4:$O$6,14,FALSE)))","v":""},{"$f":"IF(M$1019=1,\"\",IF(U627=\"\",\"\",VLOOKUP(U627,Tabelle!$B$4:$Q$6,16,FALSE)))","v":""},null,null,null,null,null,null,null,{"$f":"IF(B627=\"\",0,IF(B627=B626,COUNTIF(B$9:B626,B627)+1,1))","v":615},0,0]
["620","-1900","-1900-616",null,null,null,null,null,null,null,null,null,null,null,null,null,null,null,null,null,null,{"$f":"IF(M$1019=1,\"\",IF(U628=\"\",\"\",VLOOKUP(U628,Tabelle!$B$4:$O$6,14,FALSE)))","v":""},{"$f":"IF(M$1019=1,\"\",IF(U628=\"\",\"\",VLOOKUP(U628,Tabelle!$B$4:$Q$6,16,FALSE)))","v":""},null,null,null,null,null,null,null,{"$f":"IF(B628=\"\",0,IF(B628=B627,COUNTIF(B$9:B627,B628)+1,1))","v":616},0,0]
["621","-1900","-1900-617",null,null,null,null,null,null,null,null,null,null,null,null,null,null,null,null,null,null,{"$f":"IF(M$1019=1,\"\",IF(U629=\"\",\"\",VLOOKUP(U629,Tabelle!$B$4:$O$6,14,FALSE)))","v":""},{"$f":"IF(M$1019=1,\"\",IF(U629=\"\",\"\",VLOOKUP(U629,Tabelle!$B$4:$Q$6,16,FALSE)))","v":""},null,null,null,null,null,null,null,{"$f":"IF(B629=\"\",0,IF(B629=B628,COUNTIF(B$9:B628,B629)+1,1))","v":617},0,0]
["622","-1900","-1900-618",null,null,null,null,null,null,null,null,null,null,null,null,null,null,null,null,null,null,{"$f":"IF(M$1019=1,\"\",IF(U630=\"\",\"\",VLOOKUP(U630,Tabelle!$B$4:$O$6,14,FALSE)))","v":""},{"$f":"IF(M$1019=1,\"\",IF(U630=\"\",\"\",VLOOKUP(U630,Tabelle!$B$4:$Q$6,16,FALSE)))","v":""},null,null,null,null,null,null,null,{"$f":"IF(B630=\"\",0,IF(B630=B629,COUNTIF(B$9:B629,B630)+1,1))","v":618},0,0]
["623","-1900","-1900-619",null,null,null,null,null,null,null,null,null,null,null,null,null,null,null,null,null,null,{"$f":"IF(M$1019=1,\"\",IF(U631=\"\",\"\",VLOOKUP(U631,Tabelle!$B$4:$O$6,14,FALSE)))","v":""},{"$f":"IF(M$1019=1,\"\",IF(U631=\"\",\"\",VLOOKUP(U631,Tabelle!$B$4:$Q$6,16,FALSE)))","v":""},null,null,null,null,null,null,null,{"$f":"IF(B631=\"\",0,IF(B631=B630,COUNTIF(B$9:B630,B631)+1,1))","v":619},0,0]
["624","-1900","-1900-620",null,null,null,null,null,null,null,null,null,null,null,null,null,null,null,null,null,null,{"$f":"IF(M$1019=1,\"\",IF(U632=\"\",\"\",VLOOKUP(U632,Tabelle!$B$4:$O$6,14,FALSE)))","v":""},{"$f":"IF(M$1019=1,\"\",IF(U632=\"\",\"\",VLOOKUP(U632,Tabelle!$B$4:$Q$6,16,FALSE)))","v":""},null,null,null,null,null,null,null,{"$f":"IF(B632=\"\",0,IF(B632=B631,COUNTIF(B$9:B631,B632)+1,1))","v":620},0,0]
["625","-1900","-1900-621",null,null,null,null,null,null,null,null,null,null,null,null,null,null,null,null,null,null,{"$f":"IF(M$1019=1,\"\",IF(U633=\"\",\"\",VLOOKUP(U633,Tabelle!$B$4:$O$6,14,FALSE)))","v":""},{"$f":"IF(M$1019=1,\"\",IF(U633=\"\",\"\",VLOOKUP(U633,Tabelle!$B$4:$Q$6,16,FALSE)))","v":""},null,null,null,null,null,null,null,{"$f":"IF(B633=\"\",0,IF(B633=B632,COUNTIF(B$9:B632,B633)+1,1))","v":621},0,0]
["626","-1900","-1900-622",null,null,null,null,null,null,null,null,null,null,null,null,null,null,null,null,null,null,{"$f":"IF(M$1019=1,\"\",IF(U634=\"\",\"\",VLOOKUP(U634,Tabelle!$B$4:$O$6,14,FALSE)))","v":""},{"$f":"IF(M$1019=1,\"\",IF(U634=\"\",\"\",VLOOKUP(U634,Tabelle!$B$4:$Q$6,16,FALSE)))","v":""},null,null,null,null,null,null,null,{"$f":"IF(B634=\"\",0,IF(B634=B633,COUNTIF(B$9:B633,B634)+1,1))","v":622},0,0]
["627","-1900","-1900-623",null,null,null,null,null,null,null,null,null,null,null,null,null,null,null,null,null,null,{"$f":"IF(M$1019=1,\"\",IF(U635=\"\",\"\",VLOOKUP(U635,Tabelle!$B$4:$O$6,14,FALSE)))","v":""},{"$f":"IF(M$1019=1,\"\",IF(U635=\"\",\"\",VLOOKUP(U635,Tabelle!$B$4:$Q$6,16,FALSE)))","v":""},null,null,null,null,null,null,null,{"$f":"IF(B635=\"\",0,IF(B635=B634,COUNTIF(B$9:B634,B635)+1,1))","v":623},0,0]
["628","-1900","-1900-624",null,null,null,null,null,null,null,null,null,null,null,null,null,null,null,null,null,null,{"$f":"IF(M$1019=1,\"\",IF(U636=\"\",\"\",VLOOKUP(U636,Tabelle!$B$4:$O$6,14,FALSE)))","v":""},{"$f":"IF(M$1019=1,\"\",IF(U636=\"\",\"\",VLOOKUP(U636,Tabelle!$B$4:$Q$6,16,FALSE)))","v":""},null,null,null,null,null,null,null,{"$f":"IF(B636=\"\",0,IF(B636=B635,COUNTIF(B$9:B635,B636)+1,1))","v":624},0,0]
["629","-1900","-1900-625",null,null,null,null,null,null,null,null,null,null,null,null,null,null,null,null,null,null,{"$f":"IF(M$1019=1,\"\",IF(U637=\"\",\"\",VLOOKUP(U637,Tabelle!$B$4:$O$6,14,FALSE)))","v":""},{"$f":"IF(M$1019=1,\"\",IF(U637=\"\",\"\",VLOOKUP(U637,Tabelle!$B$4:$Q$6,16,FALSE)))","v":""},null,null,null,null,null,null,null,{"$f":"IF(B637=\"\",0,IF(B637=B636,COUNTIF(B$9:B636,B637)+1,1))","v":625},0,0]
["630","-1900","-1900-626",null,null,null,null,null,null,null,null,null,null,null,null,null,null,null,null,null,null,{"$f":"IF(M$1019=1,\"\",IF(U638=\"\",\"\",VLOOKUP(U638,Tabelle!$B$4:$O$6,14,FALSE)))","v":""},{"$f":"IF(M$1019=1,\"\",IF(U638=\"\",\"\",VLOOKUP(U638,Tabelle!$B$4:$Q$6,16,FALSE)))","v":""},null,null,null,null,null,null,null,{"$f":"IF(B638=\"\",0,IF(B638=B637,COUNTIF(B$9:B637,B638)+1,1))","v":626},0,0]
["631","-1900","-1900-627",null,null,null,null,null,null,null,null,null,null,null,null,null,null,null,null,null,null,{"$f":"IF(M$1019=1,\"\",IF(U639=\"\",\"\",VLOOKUP(U639,Tabelle!$B$4:$O$6,14,FALSE)))","v":""},{"$f":"IF(M$1019=1,\"\",IF(U639=\"\",\"\",VLOOKUP(U639,Tabelle!$B$4:$Q$6,16,FALSE)))","v":""},null,null,null,null,null,null,null,{"$f":"IF(B639=\"\",0,IF(B639=B638,COUNTIF(B$9:B638,B639)+1,1))","v":627},0,0]
["632","-1900","-1900-628",null,null,null,null,null,null,null,null,null,null,null,null,null,null,null,null,null,null,{"$f":"IF(M$1019=1,\"\",IF(U640=\"\",\"\",VLOOKUP(U640,Tabelle!$B$4:$O$6,14,FALSE)))","v":""},{"$f":"IF(M$1019=1,\"\",IF(U640=\"\",\"\",VLOOKUP(U640,Tabelle!$B$4:$Q$6,16,FALSE)))","v":""},null,null,null,null,null,null,null,{"$f":"IF(B640=\"\",0,IF(B640=B639,COUNTIF(B$9:B639,B640)+1,1))","v":628},0,0]
["633","-1900","-1900-629",null,null,null,null,null,null,null,null,null,null,null,null,null,null,null,null,null,null,{"$f":"IF(M$1019=1,\"\",IF(U641=\"\",\"\",VLOOKUP(U641,Tabelle!$B$4:$O$6,14,FALSE)))","v":""},{"$f":"IF(M$1019=1,\"\",IF(U641=\"\",\"\",VLOOKUP(U641,Tabelle!$B$4:$Q$6,16,FALSE)))","v":""},null,null,null,null,null,null,null,{"$f":"IF(B641=\"\",0,IF(B641=B640,COUNTIF(B$9:B640,B641)+1,1))","v":629},0,0]
["634","-1900","-1900-630",null,null,null,null,null,null,null,null,null,null,null,null,null,null,null,null,null,null,{"$f":"IF(M$1019=1,\"\",IF(U642=\"\",\"\",VLOOKUP(U642,Tabelle!$B$4:$O$6,14,FALSE)))","v":""},{"$f":"IF(M$1019=1,\"\",IF(U642=\"\",\"\",VLOOKUP(U642,Tabelle!$B$4:$Q$6,16,FALSE)))","v":""},null,null,null,null,null,null,null,{"$f":"IF(B642=\"\",0,IF(B642=B641,COUNTIF(B$9:B641,B642)+1,1))","v":630},0,0]
["635","-1900","-1900-631",null,null,null,null,null,null,null,null,null,null,null,null,null,null,null,null,null,null,{"$f":"IF(M$1019=1,\"\",IF(U643=\"\",\"\",VLOOKUP(U643,Tabelle!$B$4:$O$6,14,FALSE)))","v":""},{"$f":"IF(M$1019=1,\"\",IF(U643=\"\",\"\",VLOOKUP(U643,Tabelle!$B$4:$Q$6,16,FALSE)))","v":""},null,null,null,null,null,null,null,{"$f":"IF(B643=\"\",0,IF(B643=B642,COUNTIF(B$9:B642,B643)+1,1))","v":631},0,0]
["636","-1900","-1900-632",null,null,null,null,null,null,null,null,null,null,null,null,null,null,null,null,null,null,{"$f":"IF(M$1019=1,\"\",IF(U644=\"\",\"\",VLOOKUP(U644,Tabelle!$B$4:$O$6,14,FALSE)))","v":""},{"$f":"IF(M$1019=1,\"\",IF(U644=\"\",\"\",VLOOKUP(U644,Tabelle!$B$4:$Q$6,16,FALSE)))","v":""},null,null,null,null,null,null,null,{"$f":"IF(B644=\"\",0,IF(B644=B643,COUNTIF(B$9:B643,B644)+1,1))","v":632},0,0]
["637","-1900","-1900-633",null,null,null,null,null,null,null,null,null,null,null,null,null,null,null,null,null,null,{"$f":"IF(M$1019=1,\"\",IF(U645=\"\",\"\",VLOOKUP(U645,Tabelle!$B$4:$O$6,14,FALSE)))","v":""},{"$f":"IF(M$1019=1,\"\",IF(U645=\"\",\"\",VLOOKUP(U645,Tabelle!$B$4:$Q$6,16,FALSE)))","v":""},null,null,null,null,null,null,null,{"$f":"IF(B645=\"\",0,IF(B645=B644,COUNTIF(B$9:B644,B645)+1,1))","v":633},0,0]
["638","-1900","-1900-634",null,null,null,null,null,null,null,null,null,null,null,null,null,null,null,null,null,null,{"$f":"IF(M$1019=1,\"\",IF(U646=\"\",\"\",VLOOKUP(U646,Tabelle!$B$4:$O$6,14,FALSE)))","v":""},{"$f":"IF(M$1019=1,\"\",IF(U646=\"\",\"\",VLOOKUP(U646,Tabelle!$B$4:$Q$6,16,FALSE)))","v":""},null,null,null,null,null,null,null,{"$f":"IF(B646=\"\",0,IF(B646=B645,COUNTIF(B$9:B645,B646)+1,1))","v":634},0,0]
["639","-1900","-1900-635",null,null,null,null,null,null,null,null,null,null,null,null,null,null,null,null,null,null,{"$f":"IF(M$1019=1,\"\",IF(U647=\"\",\"\",VLOOKUP(U647,Tabelle!$B$4:$O$6,14,FALSE)))","v":""},{"$f":"IF(M$1019=1,\"\",IF(U647=\"\",\"\",VLOOKUP(U647,Tabelle!$B$4:$Q$6,16,FALSE)))","v":""},null,null,null,null,null,null,null,{"$f":"IF(B647=\"\",0,IF(B647=B646,COUNTIF(B$9:B646,B647)+1,1))","v":635},0,0]
["640","-1900","-1900-636",null,null,null,null,null,null,null,null,null,null,null,null,null,null,null,null,null,null,{"$f":"IF(M$1019=1,\"\",IF(U648=\"\",\"\",VLOOKUP(U648,Tabelle!$B$4:$O$6,14,FALSE)))","v":""},{"$f":"IF(M$1019=1,\"\",IF(U648=\"\",\"\",VLOOKUP(U648,Tabelle!$B$4:$Q$6,16,FALSE)))","v":""},null,null,null,null,null,null,null,{"$f":"IF(B648=\"\",0,IF(B648=B647,COUNTIF(B$9:B647,B648)+1,1))","v":636},0,0]
["641","-1900","-1900-637",null,null,null,null,null,null,null,null,null,null,null,null,null,null,null,null,null,null,{"$f":"IF(M$1019=1,\"\",IF(U649=\"\",\"\",VLOOKUP(U649,Tabelle!$B$4:$O$6,14,FALSE)))","v":""},{"$f":"IF(M$1019=1,\"\",IF(U649=\"\",\"\",VLOOKUP(U649,Tabelle!$B$4:$Q$6,16,FALSE)))","v":""},null,null,null,null,null,null,null,{"$f":"IF(B649=\"\",0,IF(B649=B648,COUNTIF(B$9:B648,B649)+1,1))","v":637},0,0]
["642",{"$f":"IF(AG650=$AG$1013,0,IF(M$1019=1,0,D650&\"-\"&YEAR(E650)))","v":"-1900"},"-1900-638",null,null,null,null,null,null,null,null,null,null,null,null,null,null,null,null,null,null,{"$f":"IF(M$1019=1,\"\",IF(U650=\"\",\"\",VLOOKUP(U650,Tabelle!$B$4:$O$6,14,FALSE)))","v":""},{"$f":"IF(M$1019=1,\"\",IF(U650=\"\",\"\",VLOOKUP(U650,Tabelle!$B$4:$Q$6,16,FALSE)))","v":""},null,null,null,null,null,null,null,{"$f":"IF(B650=\"\",0,IF(B650=B649,COUNTIF(B$9:B649,B650)+1,1))","v":638},0,{"$f":"IF(E650>0,IF(OR(MONTH(E650)<$L$1030,MONTH(E650)>$L$1031),AG$1013,0),0)","v":0}]
["643","-1900","-1900-639",null,null,null,null,null,null,null,null,null,null,null,null,null,null,null,null,null,null,{"$f":"IF(M$1019=1,\"\",IF(U651=\"\",\"\",VLOOKUP(U651,Tabelle!$B$4:$O$6,14,FALSE)))","v":""},{"$f":"IF(M$1019=1,\"\",IF(U651=\"\",\"\",VLOOKUP(U651,Tabelle!$B$4:$Q$6,16,FALSE)))","v":""},null,null,null,null,null,null,null,{"$f":"IF(B651=\"\",0,IF(B651=B650,COUNTIF(B$9:B650,B651)+1,1))","v":639},0,0]
["644","-1900","-1900-640",null,null,null,null,null,null,null,null,null,null,null,null,null,null,null,null,null,null,{"$f":"IF(M$1019=1,\"\",IF(U652=\"\",\"\",VLOOKUP(U652,Tabelle!$B$4:$O$6,14,FALSE)))","v":""},{"$f":"IF(M$1019=1,\"\",IF(U652=\"\",\"\",VLOOKUP(U652,Tabelle!$B$4:$Q$6,16,FALSE)))","v":""},null,null,null,null,null,null,null,{"$f":"IF(B652=\"\",0,IF(B652=B651,COUNTIF(B$9:B651,B652)+1,1))","v":640},0,0]
["645","-1900","-1900-641",null,null,null,null,null,null,null,null,null,null,null,null,null,null,null,null,null,null,{"$f":"IF(M$1019=1,\"\",IF(U653=\"\",\"\",VLOOKUP(U653,Tabelle!$B$4:$O$6,14,FALSE)))","v":""},{"$f":"IF(M$1019=1,\"\",IF(U653=\"\",\"\",VLOOKUP(U653,Tabelle!$B$4:$Q$6,16,FALSE)))","v":""},null,null,null,null,null,null,null,{"$f":"IF(B653=\"\",0,IF(B653=B652,COUNTIF(B$9:B652,B653)+1,1))","v":641},0,0]
["646","-1900","-1900-642",null,null,null,null,null,null,null,null,null,null,null,null,null,null,null,null,null,null,{"$f":"IF(M$1019=1,\"\",IF(U654=\"\",\"\",VLOOKUP(U654,Tabelle!$B$4:$O$6,14,FALSE)))","v":""},{"$f":"IF(M$1019=1,\"\",IF(U654=\"\",\"\",VLOOKUP(U654,Tabelle!$B$4:$Q$6,16,FALSE)))","v":""},null,null,null,null,null,null,null,{"$f":"IF(B654=\"\",0,IF(B654=B653,COUNTIF(B$9:B653,B654)+1,1))","v":642},0,0]
["647","-1900","-1900-643",null,null,null,null,null,null,null,null,null,null,null,null,null,null,null,null,null,null,{"$f":"IF(M$1019=1,\"\",IF(U655=\"\",\"\",VLOOKUP(U655,Tabelle!$B$4:$O$6,14,FALSE)))","v":""},{"$f":"IF(M$1019=1,\"\",IF(U655=\"\",\"\",VLOOKUP(U655,Tabelle!$B$4:$Q$6,16,FALSE)))","v":""},null,null,null,null,null,null,null,{"$f":"IF(B655=\"\",0,IF(B655=B654,COUNTIF(B$9:B654,B655)+1,1))","v":643},0,0]
["648","-1900","-1900-644",null,null,null,null,null,null,null,null,null,null,null,null,null,null,null,null,null,null,{"$f":"IF(M$1019=1,\"\",IF(U656=\"\",\"\",VLOOKUP(U656,Tabelle!$B$4:$O$6,14,FALSE)))","v":""},{"$f":"IF(M$1019=1,\"\",IF(U656=\"\",\"\",VLOOKUP(U656,Tabelle!$B$4:$Q$6,16,FALSE)))","v":""},null,null,null,null,null,null,null,{"$f":"IF(B656=\"\",0,IF(B656=B655,COUNTIF(B$9:B655,B656)+1,1))","v":644},0,0]
["649","-1900","-1900-645",null,null,null,null,null,null,null,null,null,null,null,null,null,null,null,null,null,null,{"$f":"IF(M$1019=1,\"\",IF(U657=\"\",\"\",VLOOKUP(U657,Tabelle!$B$4:$O$6,14,FALSE)))","v":""},{"$f":"IF(M$1019=1,\"\",IF(U657=\"\",\"\",VLOOKUP(U657,Tabelle!$B$4:$Q$6,16,FALSE)))","v":""},null,null,null,null,null,null,null,{"$f":"IF(B657=\"\",0,IF(B657=B656,COUNTIF(B$9:B656,B657)+1,1))","v":645},0,0]
["650","-1900","-1900-646",null,null,null,null,null,null,null,null,null,null,null,null,null,null,null,null,null,null,{"$f":"IF(M$1019=1,\"\",IF(U658=\"\",\"\",VLOOKUP(U658,Tabelle!$B$4:$O$6,14,FALSE)))","v":""},{"$f":"IF(M$1019=1,\"\",IF(U658=\"\",\"\",VLOOKUP(U658,Tabelle!$B$4:$Q$6,16,FALSE)))","v":""},null,null,null,null,null,null,null,{"$f":"IF(B658=\"\",0,IF(B658=B657,COUNTIF(B$9:B657,B658)+1,1))","v":646},0,0]
["651","-1900","-1900-647",null,null,null,null,null,null,null,null,null,null,null,null,null,null,null,null,null,null,{"$f":"IF(M$1019=1,\"\",IF(U659=\"\",\"\",VLOOKUP(U659,Tabelle!$B$4:$O$6,14,FALSE)))","v":""},{"$f":"IF(M$1019=1,\"\",IF(U659=\"\",\"\",VLOOKUP(U659,Tabelle!$B$4:$Q$6,16,FALSE)))","v":""},null,null,null,null,null,null,null,{"$f":"IF(B659=\"\",0,IF(B659=B658,COUNTIF(B$9:B658,B659)+1,1))","v":647},0,0]
["652","-1900","-1900-648",null,null,null,null,null,null,null,null,null,null,null,null,null,null,null,null,null,null,{"$f":"IF(M$1019=1,\"\",IF(U660=\"\",\"\",VLOOKUP(U660,Tabelle!$B$4:$O$6,14,FALSE)))","v":""},{"$f":"IF(M$1019=1,\"\",IF(U660=\"\",\"\",VLOOKUP(U660,Tabelle!$B$4:$Q$6,16,FALSE)))","v":""},null,null,null,null,null,null,null,{"$f":"IF(B660=\"\",0,IF(B660=B659,COUNTIF(B$9:B659,B660)+1,1))","v":648},{"$f":"IF(OR(D660=\"\",M$1019=1),0,IF(AE660=8,1,0))","v":0},0]
["653","-1900","-1900-649",null,null,null,null,null,null,null,null,null,null,null,null,null,null,null,null,null,null,{"$f":"IF(M$1019=1,\"\",IF(U661=\"\",\"\",VLOOKUP(U661,Tabelle!$B$4:$O$6,14,FALSE)))","v":""},{"$f":"IF(M$1019=1,\"\",IF(U661=\"\",\"\",VLOOKUP(U661,Tabelle!$B$4:$Q$6,16,FALSE)))","v":""},null,null,null,null,null,null,null,{"$f":"IF(B661=\"\",0,IF(B661=B660,COUNTIF(B$9:B660,B661)+1,1))","v":649},0,0]
["654","-1900","-1900-650",null,null,null,null,null,null,null,null,null,null,null,null,null,null,null,null,null,null,{"$f":"IF(M$1019=1,\"\",IF(U662=\"\",\"\",VLOOKUP(U662,Tabelle!$B$4:$O$6,14,FALSE)))","v":""},{"$f":"IF(M$1019=1,\"\",IF(U662=\"\",\"\",VLOOKUP(U662,Tabelle!$B$4:$Q$6,16,FALSE)))","v":""},null,null,null,null,null,null,null,{"$f":"IF(B662=\"\",0,IF(B662=B661,COUNTIF(B$9:B661,B662)+1,1))","v":650},0,0]
["655","-1900","-1900-651",null,null,null,null,null,null,null,null,null,null,null,null,null,null,null,null,null,null,{"$f":"IF(M$1019=1,\"\",IF(U663=\"\",\"\",VLOOKUP(U663,Tabelle!$B$4:$O$6,14,FALSE)))","v":""},{"$f":"IF(M$1019=1,\"\",IF(U663=\"\",\"\",VLOOKUP(U663,Tabelle!$B$4:$Q$6,16,FALSE)))","v":""},null,null,null,null,null,null,null,{"$f":"IF(B663=\"\",0,IF(B663=B662,COUNTIF(B$9:B662,B663)+1,1))","v":651},0,0]
["656","-1900","-1900-652",null,null,null,null,null,null,null,null,null,null,null,null,null,null,null,null,null,null,{"$f":"IF(M$1019=1,\"\",IF(U664=\"\",\"\",VLOOKUP(U664,Tabelle!$B$4:$O$6,14,FALSE)))","v":""},{"$f":"IF(M$1019=1,\"\",IF(U664=\"\",\"\",VLOOKUP(U664,Tabelle!$B$4:$Q$6,16,FALSE)))","v":""},null,null,null,null,null,null,null,{"$f":"IF(B664=\"\",0,IF(B664=B663,COUNTIF(B$9:B663,B664)+1,1))","v":652},0,0]
["657","-1900","-1900-653",null,null,null,null,null,null,null,null,null,null,null,null,null,null,null,null,null,null,{"$f":"IF(M$1019=1,\"\",IF(U665=\"\",\"\",VLOOKUP(U665,Tabelle!$B$4:$O$6,14,FALSE)))","v":""},{"$f":"IF(M$1019=1,\"\",IF(U665=\"\",\"\",VLOOKUP(U665,Tabelle!$B$4:$Q$6,16,FALSE)))","v":""},null,null,null,null,null,null,null,{"$f":"IF(B665=\"\",0,IF(B665=B664,COUNTIF(B$9:B664,B665)+1,1))","v":653},0,0]
["658","-1900","-1900-654",null,null,null,null,null,null,null,null,null,null,null,null,null,null,null,null,null,null,{"$f":"IF(M$1019=1,\"\",IF(U666=\"\",\"\",VLOOKUP(U666,Tabelle!$B$4:$O$6,14,FALSE)))","v":""},{"$f":"IF(M$1019=1,\"\",IF(U666=\"\",\"\",VLOOKUP(U666,Tabelle!$B$4:$Q$6,16,FALSE)))","v":""},null,null,null,null,null,null,null,{"$f":"IF(B666=\"\",0,IF(B666=B665,COUNTIF(B$9:B665,B666)+1,1))","v":654},0,0]
["659","-1900","-1900-655",null,null,null,null,null,null,null,null,null,null,null,null,null,null,null,null,null,null,{"$f":"IF(M$1019=1,\"\",IF(U667=\"\",\"\",VLOOKUP(U667,Tabelle!$B$4:$O$6,14,FALSE)))","v":""},{"$f":"IF(M$1019=1,\"\",IF(U667=\"\",\"\",VLOOKUP(U667,Tabelle!$B$4:$Q$6,16,FALSE)))","v":""},null,null,null,null,null,null,null,{"$f":"IF(B667=\"\",0,IF(B667=B666,COUNTIF(B$9:B666,B667)+1,1))","v":655},0,0]
["660","-1900","-1900-656",null,null,null,null,null,null,null,null,null,null,null,null,null,null,null,null,null,null,{"$f":"IF(M$1019=1,\"\",IF(U668=\"\",\"\",VLOOKUP(U668,Tabelle!$B$4:$O$6,14,FALSE)))","v":""},{"$f":"IF(M$1019=1,\"\",IF(U668=\"\",\"\",VLOOKUP(U668,Tabelle!$B$4:$Q$6,16,FALSE)))","v":""},null,null,null,null,null,null,null,{"$f":"IF(B668=\"\",0,IF(B668=B667,COUNTIF(B$9:B667,B668)+1,1))","v":656},0,0]
["661","-1900","-1900-657",null,null,null,null,null,null,null,null,null,null,null,null,null,null,null,null,null,null,{"$f":"IF(M$1019=1,\"\",IF(U669=\"\",\"\",VLOOKUP(U669,Tabelle!$B$4:$O$6,14,FALSE)))","v":""},{"$f":"IF(M$1019=1,\"\",IF(U669=\"\",\"\",VLOOKUP(U669,Tabelle!$B$4:$Q$6,16,FALSE)))","v":""},null,null,null,null,null,null,null,{"$f":"IF(B669=\"\",0,IF(B669=B668,COUNTIF(B$9:B668,B669)+1,1))","v":657},0,0]
["662","-1900","-1900-658",null,null,null,null,null,null,null,null,null,null,null,null,null,null,null,null,null,null,{"$f":"IF(M$1019=1,\"\",IF(U670=\"\",\"\",VLOOKUP(U670,Tabelle!$B$4:$O$6,14,FALSE)))","v":""},{"$f":"IF(M$1019=1,\"\",IF(U670=\"\",\"\",VLOOKUP(U670,Tabelle!$B$4:$Q$6,16,FALSE)))","v":""},null,null,null,null,null,null,null,{"$f":"IF(B670=\"\",0,IF(B670=B669,COUNTIF(B$9:B669,B670)+1,1))","v":658},0,0]
["663","-1900","-1900-659",null,null,null,null,null,null,null,null,null,null,null,null,null,null,null,null,null,null,{"$f":"IF(M$1019=1,\"\",IF(U671=\"\",\"\",VLOOKUP(U671,Tabelle!$B$4:$O$6,14,FALSE)))","v":""},{"$f":"IF(M$1019=1,\"\",IF(U671=\"\",\"\",VLOOKUP(U671,Tabelle!$B$4:$Q$6,16,FALSE)))","v":""},null,null,null,null,null,null,null,{"$f":"IF(B671=\"\",0,IF(B671=B670,COUNTIF(B$9:B670,B671)+1,1))","v":659},0,0]
["664","-1900","-1900-660",null,null,null,null,null,null,null,null,null,null,null,null,null,null,null,null,null,null,{"$f":"IF(M$1019=1,\"\",IF(U672=\"\",\"\",VLOOKUP(U672,Tabelle!$B$4:$O$6,14,FALSE)))","v":""},{"$f":"IF(M$1019=1,\"\",IF(U672=\"\",\"\",VLOOKUP(U672,Tabelle!$B$4:$Q$6,16,FALSE)))","v":""},null,null,null,null,null,null,null,{"$f":"IF(B672=\"\",0,IF(B672=B671,COUNTIF(B$9:B671,B672)+1,1))","v":660},0,0]
["665","-1900","-1900-661",null,null,null,null,null,null,null,null,null,null,null,null,null,null,null,null,null,null,{"$f":"IF(M$1019=1,\"\",IF(U673=\"\",\"\",VLOOKUP(U673,Tabelle!$B$4:$O$6,14,FALSE)))","v":""},{"$f":"IF(M$1019=1,\"\",IF(U673=\"\",\"\",VLOOKUP(U673,Tabelle!$B$4:$Q$6,16,FALSE)))","v":""},null,null,null,null,null,null,null,{"$f":"IF(B673=\"\",0,IF(B673=B672,COUNTIF(B$9:B672,B673)+1,1))","v":661},0,0]
["666","-1900","-1900-662",null,null,null,null,null,null,null,null,null,null,null,null,null,null,null,null,null,null,{"$f":"IF(M$1019=1,\"\",IF(U674=\"\",\"\",VLOOKUP(U674,Tabelle!$B$4:$O$6,14,FALSE)))","v":""},{"$f":"IF(M$1019=1,\"\",IF(U674=\"\",\"\",VLOOKUP(U674,Tabelle!$B$4:$Q$6,16,FALSE)))","v":""},null,null,null,null,null,null,null,{"$f":"IF(B674=\"\",0,IF(B674=B673,COUNTIF(B$9:B673,B674)+1,1))","v":662},0,0]
["667","-1900","-1900-663",null,null,null,null,null,null,null,null,null,null,null,null,null,null,null,null,null,null,{"$f":"IF(M$1019=1,\"\",IF(U675=\"\",\"\",VLOOKUP(U675,Tabelle!$B$4:$O$6,14,FALSE)))","v":""},{"$f":"IF(M$1019=1,\"\",IF(U675=\"\",\"\",VLOOKUP(U675,Tabelle!$B$4:$Q$6,16,FALSE)))","v":""},null,null,null,null,null,null,null,{"$f":"IF(B675=\"\",0,IF(B675=B674,COUNTIF(B$9:B674,B675)+1,1))","v":663},0,0]
["668","-1900","-1900-664",null,null,null,null,null,null,null,null,null,null,null,null,null,null,null,null,null,null,{"$f":"IF(M$1019=1,\"\",IF(U676=\"\",\"\",VLOOKUP(U676,Tabelle!$B$4:$O$6,14,FALSE)))","v":""},{"$f":"IF(M$1019=1,\"\",IF(U676=\"\",\"\",VLOOKUP(U676,Tabelle!$B$4:$Q$6,16,FALSE)))","v":""},null,null,null,null,null,null,null,{"$f":"IF(B676=\"\",0,IF(B676=B675,COUNTIF(B$9:B675,B676)+1,1))","v":664},0,0]
["669","-1900","-1900-665",null,null,null,null,null,null,null,null,null,null,null,null,null,null,null,null,null,null,{"$f":"IF(M$1019=1,\"\",IF(U677=\"\",\"\",VLOOKUP(U677,Tabelle!$B$4:$O$6,14,FALSE)))","v":""},{"$f":"IF(M$1019=1,\"\",IF(U677=\"\",\"\",VLOOKUP(U677,Tabelle!$B$4:$Q$6,16,FALSE)))","v":""},null,null,null,null,null,null,null,{"$f":"IF(B677=\"\",0,IF(B677=B676,COUNTIF(B$9:B676,B677)+1,1))","v":665},0,0]
["670","-1900","-1900-666",null,null,null,null,null,null,null,null,null,null,null,null,null,null,null,null,null,null,{"$f":"IF(M$1019=1,\"\",IF(U678=\"\",\"\",VLOOKUP(U678,Tabelle!$B$4:$O$6,14,FALSE)))","v":""},{"$f":"IF(M$1019=1,\"\",IF(U678=\"\",\"\",VLOOKUP(U678,Tabelle!$B$4:$Q$6,16,FALSE)))","v":""},null,null,null,null,null,null,null,{"$f":"IF(B678=\"\",0,IF(B678=B677,COUNTIF(B$9:B677,B678)+1,1))","v":666},0,0]
["671","-1900","-1900-667",null,null,null,null,null,null,null,null,null,null,null,null,null,null,null,null,null,null,{"$f":"IF(M$1019=1,\"\",IF(U679=\"\",\"\",VLOOKUP(U679,Tabelle!$B$4:$O$6,14,FALSE)))","v":""},{"$f":"IF(M$1019=1,\"\",IF(U679=\"\",\"\",VLOOKUP(U679,Tabelle!$B$4:$Q$6,16,FALSE)))","v":""},null,null,null,null,null,null,null,{"$f":"IF(B679=\"\",0,IF(B679=B678,COUNTIF(B$9:B678,B679)+1,1))","v":667},0,0]
["672","-1900","-1900-668",null,null,null,null,null,null,null,null,null,null,null,null,null,null,null,null,null,null,{"$f":"IF(M$1019=1,\"\",IF(U680=\"\",\"\",VLOOKUP(U680,Tabelle!$B$4:$O$6,14,FALSE)))","v":""},{"$f":"IF(M$1019=1,\"\",IF(U680=\"\",\"\",VLOOKUP(U680,Tabelle!$B$4:$Q$6,16,FALSE)))","v":""},null,null,null,null,null,null,null,{"$f":"IF(B680=\"\",0,IF(B680=B679,COUNTIF(B$9:B679,B680)+1,1))","v":668},0,0]
["673","-1900","-1900-669",null,null,null,null,null,null,null,null,null,null,null,null,null,null,null,null,null,null,{"$f":"IF(M$1019=1,\"\",IF(U681=\"\",\"\",VLOOKUP(U681,Tabelle!$B$4:$O$6,14,FALSE)))","v":""},{"$f":"IF(M$1019=1,\"\",IF(U681=\"\",\"\",VLOOKUP(U681,Tabelle!$B$4:$Q$6,16,FALSE)))","v":""},null,null,null,null,null,null,null,{"$f":"IF(B681=\"\",0,IF(B681=B680,COUNTIF(B$9:B680,B681)+1,1))","v":669},0,0]
["674","-1900","-1900-670",null,null,null,null,null,null,null,null,null,null,null,null,null,null,null,null,null,null,{"$f":"IF(M$1019=1,\"\",IF(U682=\"\",\"\",VLOOKUP(U682,Tabelle!$B$4:$O$6,14,FALSE)))","v":""},{"$f":"IF(M$1019=1,\"\",IF(U682=\"\",\"\",VLOOKUP(U682,Tabelle!$B$4:$Q$6,16,FALSE)))","v":""},null,null,null,null,null,null,null,{"$f":"IF(B682=\"\",0,IF(B682=B681,COUNTIF(B$9:B681,B682)+1,1))","v":670},0,0]
["675","-1900","-1900-671",null,null,null,null,null,null,null,null,null,null,null,null,null,null,null,null,null,null,{"$f":"IF(M$1019=1,\"\",IF(U683=\"\",\"\",VLOOKUP(U683,Tabelle!$B$4:$O$6,14,FALSE)))","v":""},{"$f":"IF(M$1019=1,\"\",IF(U683=\"\",\"\",VLOOKUP(U683,Tabelle!$B$4:$Q$6,16,FALSE)))","v":""},null,null,null,null,null,null,null,{"$f":"IF(B683=\"\",0,IF(B683=B682,COUNTIF(B$9:B682,B683)+1,1))","v":671},0,0]
["676","-1900","-1900-672",null,null,null,null,null,null,null,null,null,null,null,null,null,null,null,null,null,null,{"$f":"IF(M$1019=1,\"\",IF(U684=\"\",\"\",VLOOKUP(U684,Tabelle!$B$4:$O$6,14,FALSE)))","v":""},{"$f":"IF(M$1019=1,\"\",IF(U684=\"\",\"\",VLOOKUP(U684,Tabelle!$B$4:$Q$6,16,FALSE)))","v":""},null,null,null,null,null,null,null,{"$f":"IF(B684=\"\",0,IF(B684=B683,COUNTIF(B$9:B683,B684)+1,1))","v":672},0,0]
["677","-1900","-1900-673",null,null,null,null,null,null,null,null,null,null,null,null,null,null,null,null,null,null,{"$f":"IF(M$1019=1,\"\",IF(U685=\"\",\"\",VLOOKUP(U685,Tabelle!$B$4:$O$6,14,FALSE)))","v":""},{"$f":"IF(M$1019=1,\"\",IF(U685=\"\",\"\",VLOOKUP(U685,Tabelle!$B$4:$Q$6,16,FALSE)))","v":""},null,null,null,null,null,null,null,{"$f":"IF(B685=\"\",0,IF(B685=B684,COUNTIF(B$9:B684,B685)+1,1))","v":673},0,0]
["678","-1900","-1900-674",null,null,null,null,null,null,null,null,null,null,null,null,null,null,null,null,null,null,{"$f":"IF(M$1019=1,\"\",IF(U686=\"\",\"\",VLOOKUP(U686,Tabelle!$B$4:$O$6,14,FALSE)))","v":""},{"$f":"IF(M$1019=1,\"\",IF(U686=\"\",\"\",VLOOKUP(U686,Tabelle!$B$4:$Q$6,16,FALSE)))","v":""},null,null,null,null,null,null,null,{"$f":"IF(B686=\"\",0,IF(B686=B685,COUNTIF(B$9:B685,B686)+1,1))","v":674},0,0]
["679","-1900","-1900-675",null,null,null,null,null,null,null,null,null,null,null,null,null,null,null,null,null,null,{"$f":"IF(M$1019=1,\"\",IF(U687=\"\",\"\",VLOOKUP(U687,Tabelle!$B$4:$O$6,14,FALSE)))","v":""},{"$f":"IF(M$1019=1,\"\",IF(U687=\"\",\"\",VLOOKUP(U687,Tabelle!$B$4:$Q$6,16,FALSE)))","v":""},null,null,null,null,null,null,null,{"$f":"IF(B687=\"\",0,IF(B687=B686,COUNTIF(B$9:B686,B687)+1,1))","v":675},0,0]
["680","-1900","-1900-676",null,null,null,null,null,null,null,null,null,null,null,null,null,null,null,null,null,null,{"$f":"IF(M$1019=1,\"\",IF(U688=\"\",\"\",VLOOKUP(U688,Tabelle!$B$4:$O$6,14,FALSE)))","v":""},{"$f":"IF(M$1019=1,\"\",IF(U688=\"\",\"\",VLOOKUP(U688,Tabelle!$B$4:$Q$6,16,FALSE)))","v":""},null,null,null,null,null,null,null,{"$f":"IF(B688=\"\",0,IF(B688=B687,COUNTIF(B$9:B687,B688)+1,1))","v":676},0,0]
["681","-1900","-1900-677",null,null,null,null,null,null,null,null,null,null,null,null,null,null,null,null,null,null,{"$f":"IF(M$1019=1,\"\",IF(U689=\"\",\"\",VLOOKUP(U689,Tabelle!$B$4:$O$6,14,FALSE)))","v":""},{"$f":"IF(M$1019=1,\"\",IF(U689=\"\",\"\",VLOOKUP(U689,Tabelle!$B$4:$Q$6,16,FALSE)))","v":""},null,null,null,null,null,null,null,{"$f":"IF(B689=\"\",0,IF(B689=B688,COUNTIF(B$9:B688,B689)+1,1))","v":677},0,0]
["682","-1900","-1900-678",null,null,null,null,null,null,null,null,null,null,null,null,null,null,null,null,null,null,{"$f":"IF(M$1019=1,\"\",IF(U690=\"\",\"\",VLOOKUP(U690,Tabelle!$B$4:$O$6,14,FALSE)))","v":""},{"$f":"IF(M$1019=1,\"\",IF(U690=\"\",\"\",VLOOKUP(U690,Tabelle!$B$4:$Q$6,16,FALSE)))","v":""},null,null,null,null,null,null,null,{"$f":"IF(B690=\"\",0,IF(B690=B689,COUNTIF(B$9:B689,B690)+1,1))","v":678},0,0]
["683","-1900",{"$f":"IF(M$1019=1,0,B691&\"-\"&AE691)","v":"-1900-679"},null,null,null,null,null,null,null,null,null,null,null,null,null,null,null,null,null,null,{"$f":"IF(M$1019=1,\"\",IF(U691=\"\",\"\",VLOOKUP(U691,Tabelle!$B$4:$O$6,14,FALSE)))","v":""},{"$f":"IF(M$1019=1,\"\",IF(U691=\"\",\"\",VLOOKUP(U691,Tabelle!$B$4:$Q$6,16,FALSE)))","v":""},null,null,null,null,null,null,null,{"$f":"IF(B691=\"\",0,IF(B691=B690,COUNTIF(B$9:B690,B691)+1,1))","v":679},0,0]
["684","-1900","-1900-680",null,null,null,null,null,null,null,null,null,null,null,null,null,null,null,null,null,null,{"$f":"IF(M$1019=1,\"\",IF(U692=\"\",\"\",VLOOKUP(U692,Tabelle!$B$4:$O$6,14,FALSE)))","v":""},{"$f":"IF(M$1019=1,\"\",IF(U692=\"\",\"\",VLOOKUP(U692,Tabelle!$B$4:$Q$6,16,FALSE)))","v":""},null,null,null,null,null,null,null,{"$f":"IF(B692=\"\",0,IF(B692=B691,COUNTIF(B$9:B691,B692)+1,1))","v":680},0,0]
["685","-1900","-1900-681",null,null,null,null,null,null,null,null,null,null,null,null,null,null,null,null,null,null,{"$f":"IF(M$1019=1,\"\",IF(U693=\"\",\"\",VLOOKUP(U693,Tabelle!$B$4:$O$6,14,FALSE)))","v":""},{"$f":"IF(M$1019=1,\"\",IF(U693=\"\",\"\",VLOOKUP(U693,Tabelle!$B$4:$Q$6,16,FALSE)))","v":""},null,null,null,null,null,null,null,{"$f":"IF(B693=\"\",0,IF(B693=B692,COUNTIF(B$9:B692,B693)+1,1))","v":681},0,0]
["686","-1900","-1900-682",null,null,null,null,null,null,null,null,null,null,null,null,null,null,null,null,null,null,{"$f":"IF(M$1019=1,\"\",IF(U694=\"\",\"\",VLOOKUP(U694,Tabelle!$B$4:$O$6,14,FALSE)))","v":""},{"$f":"IF(M$1019=1,\"\",IF(U694=\"\",\"\",VLOOKUP(U694,Tabelle!$B$4:$Q$6,16,FALSE)))","v":""},null,null,null,null,null,null,null,{"$f":"IF(B694=\"\",0,IF(B694=B693,COUNTIF(B$9:B693,B694)+1,1))","v":682},0,0]
["687","-1900","-1900-683",null,null,null,null,null,null,null,null,null,null,null,null,null,null,null,null,null,null,{"$f":"IF(M$1019=1,\"\",IF(U695=\"\",\"\",VLOOKUP(U695,Tabelle!$B$4:$O$6,14,FALSE)))","v":""},{"$f":"IF(M$1019=1,\"\",IF(U695=\"\",\"\",VLOOKUP(U695,Tabelle!$B$4:$Q$6,16,FALSE)))","v":""},null,null,null,null,null,null,null,{"$f":"IF(B695=\"\",0,IF(B695=B694,COUNTIF(B$9:B694,B695)+1,1))","v":683},0,0]
["688","-1900","-1900-684",null,null,null,null,null,null,null,null,null,null,null,null,null,null,null,null,null,null,{"$f":"IF(M$1019=1,\"\",IF(U696=\"\",\"\",VLOOKUP(U696,Tabelle!$B$4:$O$6,14,FALSE)))","v":""},{"$f":"IF(M$1019=1,\"\",IF(U696=\"\",\"\",VLOOKUP(U696,Tabelle!$B$4:$Q$6,16,FALSE)))","v":""},null,null,null,null,null,null,null,{"$f":"IF(B696=\"\",0,IF(B696=B695,COUNTIF(B$9:B695,B696)+1,1))","v":684},0,0]
["689","-1900","-1900-685",null,null,null,null,null,null,null,null,null,null,null,null,null,null,null,null,null,null,{"$f":"IF(M$1019=1,\"\",IF(U697=\"\",\"\",VLOOKUP(U697,Tabelle!$B$4:$O$6,14,FALSE)))","v":""},{"$f":"IF(M$1019=1,\"\",IF(U697=\"\",\"\",VLOOKUP(U697,Tabelle!$B$4:$Q$6,16,FALSE)))","v":""},null,null,null,null,null,null,null,{"$f":"IF(B697=\"\",0,IF(B697=B696,COUNTIF(B$9:B696,B697)+1,1))","v":685},0,0]
["690","-1900","-1900-686",null,null,null,null,null,null,null,null,null,null,null,null,null,null,null,null,null,null,{"$f":"IF(M$1019=1,\"\",IF(U698=\"\",\"\",VLOOKUP(U698,Tabelle!$B$4:$O$6,14,FALSE)))","v":""},{"$f":"IF(M$1019=1,\"\",IF(U698=\"\",\"\",VLOOKUP(U698,Tabelle!$B$4:$Q$6,16,FALSE)))","v":""},null,null,null,null,null,null,null,{"$f":"IF(B698=\"\",0,IF(B698=B697,COUNTIF(B$9:B697,B698)+1,1))","v":686},0,0]
["691","-1900","-1900-687",null,null,null,null,null,null,null,null,null,null,null,null,null,null,null,null,null,null,{"$f":"IF(M$1019=1,\"\",IF(U699=\"\",\"\",VLOOKUP(U699,Tabelle!$B$4:$O$6,14,FALSE)))","v":""},{"$f":"IF(M$1019=1,\"\",IF(U699=\"\",\"\",VLOOKUP(U699,Tabelle!$B$4:$Q$6,16,FALSE)))","v":""},null,null,null,null,null,null,null,{"$f":"IF(B699=\"\",0,IF(B699=B698,COUNTIF(B$9:B698,B699)+1,1))","v":687},0,0]
["692","-1900","-1900-688",null,null,null,null,null,null,null,null,null,null,null,null,null,null,null,null,null,null,{"$f":"IF(M$1019=1,\"\",IF(U700=\"\",\"\",VLOOKUP(U700,Tabelle!$B$4:$O$6,14,FALSE)))","v":""},{"$f":"IF(M$1019=1,\"\",IF(U700=\"\",\"\",VLOOKUP(U700,Tabelle!$B$4:$Q$6,16,FALSE)))","v":""},null,null,null,null,null,null,null,{"$f":"IF(B700=\"\",0,IF(B700=B699,COUNTIF(B$9:B699,B700)+1,1))","v":688},0,0]
["693","-1900","-1900-689",null,null,null,null,null,null,null,null,null,null,null,null,null,null,null,null,null,null,{"$f":"IF(M$1019=1,\"\",IF(U701=\"\",\"\",VLOOKUP(U701,Tabelle!$B$4:$O$6,14,FALSE)))","v":""},{"$f":"IF(M$1019=1,\"\",IF(U701=\"\",\"\",VLOOKUP(U701,Tabelle!$B$4:$Q$6,16,FALSE)))","v":""},null,null,null,null,null,null,null,{"$f":"IF(B701=\"\",0,IF(B701=B700,COUNTIF(B$9:B700,B701)+1,1))","v":689},0,0]
["694","-1900","-1900-690",null,null,null,null,null,null,null,null,null,null,null,null,null,null,null,null,null,null,{"$f":"IF(M$1019=1,\"\",IF(U702=\"\",\"\",VLOOKUP(U702,Tabelle!$B$4:$O$6,14,FALSE)))","v":""},{"$f":"IF(M$1019=1,\"\",IF(U702=\"\",\"\",VLOOKUP(U702,Tabelle!$B$4:$Q$6,16,FALSE)))","v":""},null,null,null,null,null,null,null,{"$f":"IF(B702=\"\",0,IF(B702=B701,COUNTIF(B$9:B701,B702)+1,1))","v":690},0,0]
["695","-1900","-1900-691",null,null,null,null,null,null,null,null,null,null,null,null,null,null,null,null,null,null,{"$f":"IF(M$1019=1,\"\",IF(U703=\"\",\"\",VLOOKUP(U703,Tabelle!$B$4:$O$6,14,FALSE)))","v":""},{"$f":"IF(M$1019=1,\"\",IF(U703=\"\",\"\",VLOOKUP(U703,Tabelle!$B$4:$Q$6,16,FALSE)))","v":""},null,null,null,null,null,null,null,{"$f":"IF(B703=\"\",0,IF(B703=B702,COUNTIF(B$9:B702,B703)+1,1))","v":691},0,0]
["696","-1900","-1900-692",null,null,null,null,null,null,null,null,null,null,null,null,null,null,null,null,null,null,{"$f":"IF(M$1019=1,\"\",IF(U704=\"\",\"\",VLOOKUP(U704,Tabelle!$B$4:$O$6,14,FALSE)))","v":""},{"$f":"IF(M$1019=1,\"\",IF(U704=\"\",\"\",VLOOKUP(U704,Tabelle!$B$4:$Q$6,16,FALSE)))","v":""},null,null,null,null,null,null,null,{"$f":"IF(B704=\"\",0,IF(B704=B703,COUNTIF(B$9:B703,B704)+1,1))","v":692},0,0]
["697","-1900","-1900-693",null,null,null,null,null,null,null,null,null,null,null,null,null,null,null,null,null,null,{"$f":"IF(M$1019=1,\"\",IF(U705=\"\",\"\",VLOOKUP(U705,Tabelle!$B$4:$O$6,14,FALSE)))","v":""},{"$f":"IF(M$1019=1,\"\",IF(U705=\"\",\"\",VLOOKUP(U705,Tabelle!$B$4:$Q$6,16,FALSE)))","v":""},null,null,null,null,null,null,null,{"$f":"IF(B705=\"\",0,IF(B705=B704,COUNTIF(B$9:B704,B705)+1,1))","v":693},0,0]
["698","-1900","-1900-694",null,null,null,null,null,null,null,null,null,null,null,null,null,null,null,null,null,null,{"$f":"IF(M$1019=1,\"\",IF(U706=\"\",\"\",VLOOKUP(U706,Tabelle!$B$4:$O$6,14,FALSE)))","v":""},{"$f":"IF(M$1019=1,\"\",IF(U706=\"\",\"\",VLOOKUP(U706,Tabelle!$B$4:$Q$6,16,FALSE)))","v":""},null,null,null,null,null,null,null,{"$f":"IF(B706=\"\",0,IF(B706=B705,COUNTIF(B$9:B705,B706)+1,1))","v":694},0,0]
["699","-1900","-1900-695",null,null,null,null,null,null,null,null,null,null,null,null,null,null,null,null,null,null,{"$f":"IF(M$1019=1,\"\",IF(U707=\"\",\"\",VLOOKUP(U707,Tabelle!$B$4:$O$6,14,FALSE)))","v":""},{"$f":"IF(M$1019=1,\"\",IF(U707=\"\",\"\",VLOOKUP(U707,Tabelle!$B$4:$Q$6,16,FALSE)))","v":""},null,null,null,null,null,null,null,{"$f":"IF(B707=\"\",0,IF(B707=B706,COUNTIF(B$9:B706,B707)+1,1))","v":695},0,0]
["700","-1900","-1900-696",null,null,null,null,null,null,null,null,null,null,null,null,null,null,null,null,null,null,{"$f":"IF(M$1019=1,\"\",IF(U708=\"\",\"\",VLOOKUP(U708,Tabelle!$B$4:$O$6,14,FALSE)))","v":""},{"$f":"IF(M$1019=1,\"\",IF(U708=\"\",\"\",VLOOKUP(U708,Tabelle!$B$4:$Q$6,16,FALSE)))","v":""},null,null,null,null,null,null,null,{"$f":"IF(B708=\"\",0,IF(B708=B707,COUNTIF(B$9:B707,B708)+1,1))","v":696},0,0]
["701","-1900","-1900-697",null,null,null,null,null,null,null,null,null,null,null,null,null,null,null,null,null,null,{"$f":"IF(M$1019=1,\"\",IF(U709=\"\",\"\",VLOOKUP(U709,Tabelle!$B$4:$O$6,14,FALSE)))","v":""},{"$f":"IF(M$1019=1,\"\",IF(U709=\"\",\"\",VLOOKUP(U709,Tabelle!$B$4:$Q$6,16,FALSE)))","v":""},null,null,null,null,null,null,null,{"$f":"IF(B709=\"\",0,IF(B709=B708,COUNTIF(B$9:B708,B709)+1,1))","v":697},0,0]
["702","-1900","-1900-698",null,null,null,null,null,null,null,null,null,null,null,null,null,null,null,null,null,null,{"$f":"IF(M$1019=1,\"\",IF(U710=\"\",\"\",VLOOKUP(U710,Tabelle!$B$4:$O$6,14,FALSE)))","v":""},{"$f":"IF(M$1019=1,\"\",IF(U710=\"\",\"\",VLOOKUP(U710,Tabelle!$B$4:$Q$6,16,FALSE)))","v":""},null,null,null,null,null,null,null,{"$f":"IF(B710=\"\",0,IF(B710=B709,COUNTIF(B$9:B709,B710)+1,1))","v":698},0,0]
["703","-1900","-1900-699",null,null,null,null,null,null,null,null,null,null,null,null,null,null,null,null,null,null,{"$f":"IF(M$1019=1,\"\",IF(U711=\"\",\"\",VLOOKUP(U711,Tabelle!$B$4:$O$6,14,FALSE)))","v":""},{"$f":"IF(M$1019=1,\"\",IF(U711=\"\",\"\",VLOOKUP(U711,Tabelle!$B$4:$Q$6,16,FALSE)))","v":""},null,null,null,null,null,null,null,{"$f":"IF(B711=\"\",0,IF(B711=B710,COUNTIF(B$9:B710,B711)+1,1))","v":699},0,0]
["704","-1900","-1900-700",null,null,null,null,null,null,null,null,null,null,null,null,null,null,null,null,null,null,{"$f":"IF(M$1019=1,\"\",IF(U712=\"\",\"\",VLOOKUP(U712,Tabelle!$B$4:$O$6,14,FALSE)))","v":""},{"$f":"IF(M$1019=1,\"\",IF(U712=\"\",\"\",VLOOKUP(U712,Tabelle!$B$4:$Q$6,16,FALSE)))","v":""},null,null,null,null,null,null,null,{"$f":"IF(B712=\"\",0,IF(B712=B711,COUNTIF(B$9:B711,B712)+1,1))","v":700},0,0]
["705","-1900","-1900-701",null,null,null,null,null,null,null,null,null,null,null,null,null,null,null,null,null,null,{"$f":"IF(M$1019=1,\"\",IF(U713=\"\",\"\",VLOOKUP(U713,Tabelle!$B$4:$O$6,14,FALSE)))","v":""},{"$f":"IF(M$1019=1,\"\",IF(U713=\"\",\"\",VLOOKUP(U713,Tabelle!$B$4:$Q$6,16,FALSE)))","v":""},null,null,null,null,null,null,null,{"$f":"IF(B713=\"\",0,IF(B713=B712,COUNTIF(B$9:B712,B713)+1,1))","v":701},0,0]
["706",{"$f":"IF(AG714=$AG$1013,0,IF(M$1019=1,0,D714&\"-\"&YEAR(E714)))","v":"-1900"},"-1900-702",null,null,null,null,null,null,null,null,null,null,null,null,null,null,null,null,null,null,{"$f":"IF(M$1019=1,\"\",IF(U714=\"\",\"\",VLOOKUP(U714,Tabelle!$B$4:$O$6,14,FALSE)))","v":""},{"$f":"IF(M$1019=1,\"\",IF(U714=\"\",\"\",VLOOKUP(U714,Tabelle!$B$4:$Q$6,16,FALSE)))","v":""},null,null,null,null,null,null,null,{"$f":"IF(B714=\"\",0,IF(B714=B713,COUNTIF(B$9:B713,B714)+1,1))","v":702},0,{"$f":"IF(E714>0,IF(OR(MONTH(E714)<$L$1030,MONTH(E714)>$L$1031),AG$1013,0),0)","v":0}]
["707","-1900","-1900-703",null,null,null,null,null,null,null,null,null,null,null,null,null,null,null,null,null,null,{"$f":"IF(M$1019=1,\"\",IF(U715=\"\",\"\",VLOOKUP(U715,Tabelle!$B$4:$O$6,14,FALSE)))","v":""},{"$f":"IF(M$1019=1,\"\",IF(U715=\"\",\"\",VLOOKUP(U715,Tabelle!$B$4:$Q$6,16,FALSE)))","v":""},null,null,null,null,null,null,null,{"$f":"IF(B715=\"\",0,IF(B715=B714,COUNTIF(B$9:B714,B715)+1,1))","v":703},0,0]
["708","-1900","-1900-704",null,null,null,null,null,null,null,null,null,null,null,null,null,null,null,null,null,null,{"$f":"IF(M$1019=1,\"\",IF(U716=\"\",\"\",VLOOKUP(U716,Tabelle!$B$4:$O$6,14,FALSE)))","v":""},{"$f":"IF(M$1019=1,\"\",IF(U716=\"\",\"\",VLOOKUP(U716,Tabelle!$B$4:$Q$6,16,FALSE)))","v":""},null,null,null,null,null,null,null,{"$f":"IF(B716=\"\",0,IF(B716=B715,COUNTIF(B$9:B715,B716)+1,1))","v":704},0,0]
["709","-1900","-1900-705",null,null,null,null,null,null,null,null,null,null,null,null,null,null,null,null,null,null,{"$f":"IF(M$1019=1,\"\",IF(U717=\"\",\"\",VLOOKUP(U717,Tabelle!$B$4:$O$6,14,FALSE)))","v":""},{"$f":"IF(M$1019=1,\"\",IF(U717=\"\",\"\",VLOOKUP(U717,Tabelle!$B$4:$Q$6,16,FALSE)))","v":""},null,null,null,null,null,null,null,{"$f":"IF(B717=\"\",0,IF(B717=B716,COUNTIF(B$9:B716,B717)+1,1))","v":705},0,0]
["710","-1900","-1900-706",null,null,null,null,null,null,null,null,null,null,null,null,null,null,null,null,null,null,{"$f":"IF(M$1019=1,\"\",IF(U718=\"\",\"\",VLOOKUP(U718,Tabelle!$B$4:$O$6,14,FALSE)))","v":""},{"$f":"IF(M$1019=1,\"\",IF(U718=\"\",\"\",VLOOKUP(U718,Tabelle!$B$4:$Q$6,16,FALSE)))","v":""},null,null,null,null,null,null,null,{"$f":"IF(B718=\"\",0,IF(B718=B717,COUNTIF(B$9:B717,B718)+1,1))","v":706},0,0]
["711","-1900","-1900-707",null,null,null,null,null,null,null,null,null,null,null,null,null,null,null,null,null,null,{"$f":"IF(M$1019=1,\"\",IF(U719=\"\",\"\",VLOOKUP(U719,Tabelle!$B$4:$O$6,14,FALSE)))","v":""},{"$f":"IF(M$1019=1,\"\",IF(U719=\"\",\"\",VLOOKUP(U719,Tabelle!$B$4:$Q$6,16,FALSE)))","v":""},null,null,null,null,null,null,null,{"$f":"IF(B719=\"\",0,IF(B719=B718,COUNTIF(B$9:B718,B719)+1,1))","v":707},0,0]
["712","-1900","-1900-708",null,null,null,null,null,null,null,null,null,null,null,null,null,null,null,null,null,null,{"$f":"IF(M$1019=1,\"\",IF(U720=\"\",\"\",VLOOKUP(U720,Tabelle!$B$4:$O$6,14,FALSE)))","v":""},{"$f":"IF(M$1019=1,\"\",IF(U720=\"\",\"\",VLOOKUP(U720,Tabelle!$B$4:$Q$6,16,FALSE)))","v":""},null,null,null,null,null,null,null,{"$f":"IF(B720=\"\",0,IF(B720=B719,COUNTIF(B$9:B719,B720)+1,1))","v":708},0,0]
["713","-1900","-1900-709",null,null,null,null,null,null,null,null,null,null,null,null,null,null,null,null,null,null,{"$f":"IF(M$1019=1,\"\",IF(U721=\"\",\"\",VLOOKUP(U721,Tabelle!$B$4:$O$6,14,FALSE)))","v":""},{"$f":"IF(M$1019=1,\"\",IF(U721=\"\",\"\",VLOOKUP(U721,Tabelle!$B$4:$Q$6,16,FALSE)))","v":""},null,null,null,null,null,null,null,{"$f":"IF(B721=\"\",0,IF(B721=B720,COUNTIF(B$9:B720,B721)+1,1))","v":709},0,0]
["714","-1900","-1900-710",null,null,null,null,null,null,null,null,null,null,null,null,null,null,null,null,null,null,{"$f":"IF(M$1019=1,\"\",IF(U722=\"\",\"\",VLOOKUP(U722,Tabelle!$B$4:$O$6,14,FALSE)))","v":""},{"$f":"IF(M$1019=1,\"\",IF(U722=\"\",\"\",VLOOKUP(U722,Tabelle!$B$4:$Q$6,16,FALSE)))","v":""},null,null,null,null,null,null,null,{"$f":"IF(B722=\"\",0,IF(B722=B721,COUNTIF(B$9:B721,B722)+1,1))","v":710},0,0]
["715","-1900","-1900-711",null,null,null,null,null,null,null,null,null,null,null,null,null,null,null,null,null,null,{"$f":"IF(M$1019=1,\"\",IF(U723=\"\",\"\",VLOOKUP(U723,Tabelle!$B$4:$O$6,14,FALSE)))","v":""},{"$f":"IF(M$1019=1,\"\",IF(U723=\"\",\"\",VLOOKUP(U723,Tabelle!$B$4:$Q$6,16,FALSE)))","v":""},null,null,null,null,null,null,null,{"$f":"IF(B723=\"\",0,IF(B723=B722,COUNTIF(B$9:B722,B723)+1,1))","v":711},0,0]
["716","-1900","-1900-712",null,null,null,null,null,null,null,null,null,null,null,null,null,null,null,null,null,null,{"$f":"IF(M$1019=1,\"\",IF(U724=\"\",\"\",VLOOKUP(U724,Tabelle!$B$4:$O$6,14,FALSE)))","v":""},{"$f":"IF(M$1019=1,\"\",IF(U724=\"\",\"\",VLOOKUP(U724,Tabelle!$B$4:$Q$6,16,FALSE)))","v":""},null,null,null,null,null,null,null,{"$f":"IF(B724=\"\",0,IF(B724=B723,COUNTIF(B$9:B723,B724)+1,1))","v":712},{"$f":"IF(OR(D724=\"\",M$1019=1),0,IF(AE724=8,1,0))","v":0},0]
["717","-1900","-1900-713",null,null,null,null,null,null,null,null,null,null,null,null,null,null,null,null,null,null,{"$f":"IF(M$1019=1,\"\",IF(U725=\"\",\"\",VLOOKUP(U725,Tabelle!$B$4:$O$6,14,FALSE)))","v":""},{"$f":"IF(M$1019=1,\"\",IF(U725=\"\",\"\",VLOOKUP(U725,Tabelle!$B$4:$Q$6,16,FALSE)))","v":""},null,null,null,null,null,null,null,{"$f":"IF(B725=\"\",0,IF(B725=B724,COUNTIF(B$9:B724,B725)+1,1))","v":713},0,0]
["718","-1900","-1900-714",null,null,null,null,null,null,null,null,null,null,null,null,null,null,null,null,null,null,{"$f":"IF(M$1019=1,\"\",IF(U726=\"\",\"\",VLOOKUP(U726,Tabelle!$B$4:$O$6,14,FALSE)))","v":""},{"$f":"IF(M$1019=1,\"\",IF(U726=\"\",\"\",VLOOKUP(U726,Tabelle!$B$4:$Q$6,16,FALSE)))","v":""},null,null,null,null,null,null,null,{"$f":"IF(B726=\"\",0,IF(B726=B725,COUNTIF(B$9:B725,B726)+1,1))","v":714},0,0]
["719","-1900","-1900-715",null,null,null,null,null,null,null,null,null,null,null,null,null,null,null,null,null,null,{"$f":"IF(M$1019=1,\"\",IF(U727=\"\",\"\",VLOOKUP(U727,Tabelle!$B$4:$O$6,14,FALSE)))","v":""},{"$f":"IF(M$1019=1,\"\",IF(U727=\"\",\"\",VLOOKUP(U727,Tabelle!$B$4:$Q$6,16,FALSE)))","v":""},null,null,null,null,null,null,null,{"$f":"IF(B727=\"\",0,IF(B727=B726,COUNTIF(B$9:B726,B727)+1,1))","v":715},0,0]
["720","-1900","-1900-716",null,null,null,null,null,null,null,null,null,null,null,null,null,null,null,null,null,null,{"$f":"IF(M$1019=1,\"\",IF(U728=\"\",\"\",VLOOKUP(U728,Tabelle!$B$4:$O$6,14,FALSE)))","v":""},{"$f":"IF(M$1019=1,\"\",IF(U728=\"\",\"\",VLOOKUP(U728,Tabelle!$B$4:$Q$6,16,FALSE)))","v":""},null,null,null,null,null,null,null,{"$f":"IF(B728=\"\",0,IF(B728=B727,COUNTIF(B$9:B727,B728)+1,1))","v":716},0,0]
["721","-1900","-1900-717",null,null,null,null,null,null,null,null,null,null,null,null,null,null,null,null,null,null,{"$f":"IF(M$1019=1,\"\",IF(U729=\"\",\"\",VLOOKUP(U729,Tabelle!$B$4:$O$6,14,FALSE)))","v":""},{"$f":"IF(M$1019=1,\"\",IF(U729=\"\",\"\",VLOOKUP(U729,Tabelle!$B$4:$Q$6,16,FALSE)))","v":""},null,null,null,null,null,null,null,{"$f":"IF(B729=\"\",0,IF(B729=B728,COUNTIF(B$9:B728,B729)+1,1))","v":717},0,0]
["722","-1900","-1900-718",null,null,null,null,null,null,null,null,null,null,null,null,null,null,null,null,null,null,{"$f":"IF(M$1019=1,\"\",IF(U730=\"\",\"\",VLOOKUP(U730,Tabelle!$B$4:$O$6,14,FALSE)))","v":""},{"$f":"IF(M$1019=1,\"\",IF(U730=\"\",\"\",VLOOKUP(U730,Tabelle!$B$4:$Q$6,16,FALSE)))","v":""},null,null,null,null,null,null,null,{"$f":"IF(B730=\"\",0,IF(B730=B729,COUNTIF(B$9:B729,B730)+1,1))","v":718},0,0]
["723","-1900","-1900-719",null,null,null,null,null,null,null,null,null,null,null,null,null,null,null,null,null,null,{"$f":"IF(M$1019=1,\"\",IF(U731=\"\",\"\",VLOOKUP(U731,Tabelle!$B$4:$O$6,14,FALSE)))","v":""},{"$f":"IF(M$1019=1,\"\",IF(U731=\"\",\"\",VLOOKUP(U731,Tabelle!$B$4:$Q$6,16,FALSE)))","v":""},null,null,null,null,null,null,null,{"$f":"IF(B731=\"\",0,IF(B731=B730,COUNTIF(B$9:B730,B731)+1,1))","v":719},0,0]
["724","-1900","-1900-720",null,null,null,null,null,null,null,null,null,null,null,null,null,null,null,null,null,null,{"$f":"IF(M$1019=1,\"\",IF(U732=\"\",\"\",VLOOKUP(U732,Tabelle!$B$4:$O$6,14,FALSE)))","v":""},{"$f":"IF(M$1019=1,\"\",IF(U732=\"\",\"\",VLOOKUP(U732,Tabelle!$B$4:$Q$6,16,FALSE)))","v":""},null,null,null,null,null,null,null,{"$f":"IF(B732=\"\",0,IF(B732=B731,COUNTIF(B$9:B731,B732)+1,1))","v":720},0,0]
["725","-1900","-1900-721",null,null,null,null,null,null,null,null,null,null,null,null,null,null,null,null,null,null,{"$f":"IF(M$1019=1,\"\",IF(U733=\"\",\"\",VLOOKUP(U733,Tabelle!$B$4:$O$6,14,FALSE)))","v":""},{"$f":"IF(M$1019=1,\"\",IF(U733=\"\",\"\",VLOOKUP(U733,Tabelle!$B$4:$Q$6,16,FALSE)))","v":""},null,null,null,null,null,null,null,{"$f":"IF(B733=\"\",0,IF(B733=B732,COUNTIF(B$9:B732,B733)+1,1))","v":721},0,0]
["726","-1900","-1900-722",null,null,null,null,null,null,null,null,null,null,null,null,null,null,null,null,null,null,{"$f":"IF(M$1019=1,\"\",IF(U734=\"\",\"\",VLOOKUP(U734,Tabelle!$B$4:$O$6,14,FALSE)))","v":""},{"$f":"IF(M$1019=1,\"\",IF(U734=\"\",\"\",VLOOKUP(U734,Tabelle!$B$4:$Q$6,16,FALSE)))","v":""},null,null,null,null,null,null,null,{"$f":"IF(B734=\"\",0,IF(B734=B733,COUNTIF(B$9:B733,B734)+1,1))","v":722},0,0]
["727","-1900","-1900-723",null,null,null,null,null,null,null,null,null,null,null,null,null,null,null,null,null,null,{"$f":"IF(M$1019=1,\"\",IF(U735=\"\",\"\",VLOOKUP(U735,Tabelle!$B$4:$O$6,14,FALSE)))","v":""},{"$f":"IF(M$1019=1,\"\",IF(U735=\"\",\"\",VLOOKUP(U735,Tabelle!$B$4:$Q$6,16,FALSE)))","v":""},null,null,null,null,null,null,null,{"$f":"IF(B735=\"\",0,IF(B735=B734,COUNTIF(B$9:B734,B735)+1,1))","v":723},0,0]
["728","-1900","-1900-724",null,null,null,null,null,null,null,null,null,null,null,null,null,null,null,null,null,null,{"$f":"IF(M$1019=1,\"\",IF(U736=\"\",\"\",VLOOKUP(U736,Tabelle!$B$4:$O$6,14,FALSE)))","v":""},{"$f":"IF(M$1019=1,\"\",IF(U736=\"\",\"\",VLOOKUP(U736,Tabelle!$B$4:$Q$6,16,FALSE)))","v":""},null,null,null,null,null,null,null,{"$f":"IF(B736=\"\",0,IF(B736=B735,COUNTIF(B$9:B735,B736)+1,1))","v":724},0,0]
["729","-1900","-1900-725",null,null,null,null,null,null,null,null,null,null,null,null,null,null,null,null,null,null,{"$f":"IF(M$1019=1,\"\",IF(U737=\"\",\"\",VLOOKUP(U737,Tabelle!$B$4:$O$6,14,FALSE)))","v":""},{"$f":"IF(M$1019=1,\"\",IF(U737=\"\",\"\",VLOOKUP(U737,Tabelle!$B$4:$Q$6,16,FALSE)))","v":""},null,null,null,null,null,null,null,{"$f":"IF(B737=\"\",0,IF(B737=B736,COUNTIF(B$9:B736,B737)+1,1))","v":725},0,0]
["730","-1900","-1900-726",null,null,null,null,null,null,null,null,null,null,null,null,null,null,null,null,null,null,{"$f":"IF(M$1019=1,\"\",IF(U738=\"\",\"\",VLOOKUP(U738,Tabelle!$B$4:$O$6,14,FALSE)))","v":""},{"$f":"IF(M$1019=1,\"\",IF(U738=\"\",\"\",VLOOKUP(U738,Tabelle!$B$4:$Q$6,16,FALSE)))","v":""},null,null,null,null,null,null,null,{"$f":"IF(B738=\"\",0,IF(B738=B737,COUNTIF(B$9:B737,B738)+1,1))","v":726},0,0]
["731","-1900","-1900-727",null,null,null,null,null,null,null,null,null,null,null,null,null,null,null,null,null,null,{"$f":"IF(M$1019=1,\"\",IF(U739=\"\",\"\",VLOOKUP(U739,Tabelle!$B$4:$O$6,14,FALSE)))","v":""},{"$f":"IF(M$1019=1,\"\",IF(U739=\"\",\"\",VLOOKUP(U739,Tabelle!$B$4:$Q$6,16,FALSE)))","v":""},null,null,null,null,null,null,null,{"$f":"IF(B739=\"\",0,IF(B739=B738,COUNTIF(B$9:B738,B739)+1,1))","v":727},0,0]
["732","-1900","-1900-728",null,null,null,null,null,null,null,null,null,null,null,null,null,null,null,null,null,null,{"$f":"IF(M$1019=1,\"\",IF(U740=\"\",\"\",VLOOKUP(U740,Tabelle!$B$4:$O$6,14,FALSE)))","v":""},{"$f":"IF(M$1019=1,\"\",IF(U740=\"\",\"\",VLOOKUP(U740,Tabelle!$B$4:$Q$6,16,FALSE)))","v":""},null,null,null,null,null,null,null,{"$f":"IF(B740=\"\",0,IF(B740=B739,COUNTIF(B$9:B739,B740)+1,1))","v":728},0,0]
["733","-1900","-1900-729",null,null,null,null,null,null,null,null,null,null,null,null,null,null,null,null,null,null,{"$f":"IF(M$1019=1,\"\",IF(U741=\"\",\"\",VLOOKUP(U741,Tabelle!$B$4:$O$6,14,FALSE)))","v":""},{"$f":"IF(M$1019=1,\"\",IF(U741=\"\",\"\",VLOOKUP(U741,Tabelle!$B$4:$Q$6,16,FALSE)))","v":""},null,null,null,null,null,null,null,{"$f":"IF(B741=\"\",0,IF(B741=B740,COUNTIF(B$9:B740,B741)+1,1))","v":729},0,0]
["734","-1900","-1900-730",null,null,null,null,null,null,null,null,null,null,null,null,null,null,null,null,null,null,{"$f":"IF(M$1019=1,\"\",IF(U742=\"\",\"\",VLOOKUP(U742,Tabelle!$B$4:$O$6,14,FALSE)))","v":""},{"$f":"IF(M$1019=1,\"\",IF(U742=\"\",\"\",VLOOKUP(U742,Tabelle!$B$4:$Q$6,16,FALSE)))","v":""},null,null,null,null,null,null,null,{"$f":"IF(B742=\"\",0,IF(B742=B741,COUNTIF(B$9:B741,B742)+1,1))","v":730},0,0]
["735","-1900","-1900-731",null,null,null,null,null,null,null,null,null,null,null,null,null,null,null,null,null,null,{"$f":"IF(M$1019=1,\"\",IF(U743=\"\",\"\",VLOOKUP(U743,Tabelle!$B$4:$O$6,14,FALSE)))","v":""},{"$f":"IF(M$1019=1,\"\",IF(U743=\"\",\"\",VLOOKUP(U743,Tabelle!$B$4:$Q$6,16,FALSE)))","v":""},null,null,null,null,null,null,null,{"$f":"IF(B743=\"\",0,IF(B743=B742,COUNTIF(B$9:B742,B743)+1,1))","v":731},0,0]
["736","-1900","-1900-732",null,null,null,null,null,null,null,null,null,null,null,null,null,null,null,null,null,null,{"$f":"IF(M$1019=1,\"\",IF(U744=\"\",\"\",VLOOKUP(U744,Tabelle!$B$4:$O$6,14,FALSE)))","v":""},{"$f":"IF(M$1019=1,\"\",IF(U744=\"\",\"\",VLOOKUP(U744,Tabelle!$B$4:$Q$6,16,FALSE)))","v":""},null,null,null,null,null,null,null,{"$f":"IF(B744=\"\",0,IF(B744=B743,COUNTIF(B$9:B743,B744)+1,1))","v":732},0,0]
["737","-1900","-1900-733",null,null,null,null,null,null,null,null,null,null,null,null,null,null,null,null,null,null,{"$f":"IF(M$1019=1,\"\",IF(U745=\"\",\"\",VLOOKUP(U745,Tabelle!$B$4:$O$6,14,FALSE)))","v":""},{"$f":"IF(M$1019=1,\"\",IF(U745=\"\",\"\",VLOOKUP(U745,Tabelle!$B$4:$Q$6,16,FALSE)))","v":""},null,null,null,null,null,null,null,{"$f":"IF(B745=\"\",0,IF(B745=B744,COUNTIF(B$9:B744,B745)+1,1))","v":733},0,0]
["738","-1900","-1900-734",null,null,null,null,null,null,null,null,null,null,null,null,null,null,null,null,null,null,{"$f":"IF(M$1019=1,\"\",IF(U746=\"\",\"\",VLOOKUP(U746,Tabelle!$B$4:$O$6,14,FALSE)))","v":""},{"$f":"IF(M$1019=1,\"\",IF(U746=\"\",\"\",VLOOKUP(U746,Tabelle!$B$4:$Q$6,16,FALSE)))","v":""},null,null,null,null,null,null,null,{"$f":"IF(B746=\"\",0,IF(B746=B745,COUNTIF(B$9:B745,B746)+1,1))","v":734},0,0]
["739","-1900","-1900-735",null,null,null,null,null,null,null,null,null,null,null,null,null,null,null,null,null,null,{"$f":"IF(M$1019=1,\"\",IF(U747=\"\",\"\",VLOOKUP(U747,Tabelle!$B$4:$O$6,14,FALSE)))","v":""},{"$f":"IF(M$1019=1,\"\",IF(U747=\"\",\"\",VLOOKUP(U747,Tabelle!$B$4:$Q$6,16,FALSE)))","v":""},null,null,null,null,null,null,null,{"$f":"IF(B747=\"\",0,IF(B747=B746,COUNTIF(B$9:B746,B747)+1,1))","v":735},0,0]
["740","-1900","-1900-736",null,null,null,null,null,null,null,null,null,null,null,null,null,null,null,null,null,null,{"$f":"IF(M$1019=1,\"\",IF(U748=\"\",\"\",VLOOKUP(U748,Tabelle!$B$4:$O$6,14,FALSE)))","v":""},{"$f":"IF(M$1019=1,\"\",IF(U748=\"\",\"\",VLOOKUP(U748,Tabelle!$B$4:$Q$6,16,FALSE)))","v":""},null,null,null,null,null,null,null,{"$f":"IF(B748=\"\",0,IF(B748=B747,COUNTIF(B$9:B747,B748)+1,1))","v":736},0,0]
["741","-1900","-1900-737",null,null,null,null,null,null,null,null,null,null,null,null,null,null,null,null,null,null,{"$f":"IF(M$1019=1,\"\",IF(U749=\"\",\"\",VLOOKUP(U749,Tabelle!$B$4:$O$6,14,FALSE)))","v":""},{"$f":"IF(M$1019=1,\"\",IF(U749=\"\",\"\",VLOOKUP(U749,Tabelle!$B$4:$Q$6,16,FALSE)))","v":""},null,null,null,null,null,null,null,{"$f":"IF(B749=\"\",0,IF(B749=B748,COUNTIF(B$9:B748,B749)+1,1))","v":737},0,0]
["742","-1900","-1900-738",null,null,null,null,null,null,null,null,null,null,null,null,null,null,null,null,null,null,{"$f":"IF(M$1019=1,\"\",IF(U750=\"\",\"\",VLOOKUP(U750,Tabelle!$B$4:$O$6,14,FALSE)))","v":""},{"$f":"IF(M$1019=1,\"\",IF(U750=\"\",\"\",VLOOKUP(U750,Tabelle!$B$4:$Q$6,16,FALSE)))","v":""},null,null,null,null,null,null,null,{"$f":"IF(B750=\"\",0,IF(B750=B749,COUNTIF(B$9:B749,B750)+1,1))","v":738},0,0]
["743","-1900","-1900-739",null,null,null,null,null,null,null,null,null,null,null,null,null,null,null,null,null,null,{"$f":"IF(M$1019=1,\"\",IF(U751=\"\",\"\",VLOOKUP(U751,Tabelle!$B$4:$O$6,14,FALSE)))","v":""},{"$f":"IF(M$1019=1,\"\",IF(U751=\"\",\"\",VLOOKUP(U751,Tabelle!$B$4:$Q$6,16,FALSE)))","v":""},null,null,null,null,null,null,null,{"$f":"IF(B751=\"\",0,IF(B751=B750,COUNTIF(B$9:B750,B751)+1,1))","v":739},0,0]
["744","-1900","-1900-740",null,null,null,null,null,null,null,null,null,null,null,null,null,null,null,null,null,null,{"$f":"IF(M$1019=1,\"\",IF(U752=\"\",\"\",VLOOKUP(U752,Tabelle!$B$4:$O$6,14,FALSE)))","v":""},{"$f":"IF(M$1019=1,\"\",IF(U752=\"\",\"\",VLOOKUP(U752,Tabelle!$B$4:$Q$6,16,FALSE)))","v":""},null,null,null,null,null,null,null,{"$f":"IF(B752=\"\",0,IF(B752=B751,COUNTIF(B$9:B751,B752)+1,1))","v":740},0,0]
["745","-1900","-1900-741",null,null,null,null,null,null,null,null,null,null,null,null,null,null,null,null,null,null,{"$f":"IF(M$1019=1,\"\",IF(U753=\"\",\"\",VLOOKUP(U753,Tabelle!$B$4:$O$6,14,FALSE)))","v":""},{"$f":"IF(M$1019=1,\"\",IF(U753=\"\",\"\",VLOOKUP(U753,Tabelle!$B$4:$Q$6,16,FALSE)))","v":""},null,null,null,null,null,null,null,{"$f":"IF(B753=\"\",0,IF(B753=B752,COUNTIF(B$9:B752,B753)+1,1))","v":741},0,0]
["746","-1900","-1900-742",null,null,null,null,null,null,null,null,null,null,null,null,null,null,null,null,null,null,{"$f":"IF(M$1019=1,\"\",IF(U754=\"\",\"\",VLOOKUP(U754,Tabelle!$B$4:$O$6,14,FALSE)))","v":""},{"$f":"IF(M$1019=1,\"\",IF(U754=\"\",\"\",VLOOKUP(U754,Tabelle!$B$4:$Q$6,16,FALSE)))","v":""},null,null,null,null,null,null,null,{"$f":"IF(B754=\"\",0,IF(B754=B753,COUNTIF(B$9:B753,B754)+1,1))","v":742},0,0]
["747","-1900",{"$f":"IF(M$1019=1,0,B755&\"-\"&AE755)","v":"-1900-743"},null,null,null,null,null,null,null,null,null,null,null,null,null,null,null,null,null,null,{"$f":"IF(M$1019=1,\"\",IF(U755=\"\",\"\",VLOOKUP(U755,Tabelle!$B$4:$O$6,14,FALSE)))","v":""},{"$f":"IF(M$1019=1,\"\",IF(U755=\"\",\"\",VLOOKUP(U755,Tabelle!$B$4:$Q$6,16,FALSE)))","v":""},null,null,null,null,null,null,null,{"$f":"IF(B755=\"\",0,IF(B755=B754,COUNTIF(B$9:B754,B755)+1,1))","v":743},0,0]
["748","-1900","-1900-744",null,null,null,null,null,null,null,null,null,null,null,null,null,null,null,null,null,null,{"$f":"IF(M$1019=1,\"\",IF(U756=\"\",\"\",VLOOKUP(U756,Tabelle!$B$4:$O$6,14,FALSE)))","v":""},{"$f":"IF(M$1019=1,\"\",IF(U756=\"\",\"\",VLOOKUP(U756,Tabelle!$B$4:$Q$6,16,FALSE)))","v":""},null,null,null,null,null,null,null,{"$f":"IF(B756=\"\",0,IF(B756=B755,COUNTIF(B$9:B755,B756)+1,1))","v":744},0,0]
["749","-1900","-1900-745",null,null,null,null,null,null,null,null,null,null,null,null,null,null,null,null,null,null,{"$f":"IF(M$1019=1,\"\",IF(U757=\"\",\"\",VLOOKUP(U757,Tabelle!$B$4:$O$6,14,FALSE)))","v":""},{"$f":"IF(M$1019=1,\"\",IF(U757=\"\",\"\",VLOOKUP(U757,Tabelle!$B$4:$Q$6,16,FALSE)))","v":""},null,null,null,null,null,null,null,{"$f":"IF(B757=\"\",0,IF(B757=B756,COUNTIF(B$9:B756,B757)+1,1))","v":745},0,0]
["750","-1900","-1900-746",null,null,null,null,null,null,null,null,null,null,null,null,null,null,null,null,null,null,{"$f":"IF(M$1019=1,\"\",IF(U758=\"\",\"\",VLOOKUP(U758,Tabelle!$B$4:$O$6,14,FALSE)))","v":""},{"$f":"IF(M$1019=1,\"\",IF(U758=\"\",\"\",VLOOKUP(U758,Tabelle!$B$4:$Q$6,16,FALSE)))","v":""},null,null,null,null,null,null,null,{"$f":"IF(B758=\"\",0,IF(B758=B757,COUNTIF(B$9:B757,B758)+1,1))","v":746},0,0]
["751","-1900","-1900-747",null,null,null,null,null,null,null,null,null,null,null,null,null,null,null,null,null,null,{"$f":"IF(M$1019=1,\"\",IF(U759=\"\",\"\",VLOOKUP(U759,Tabelle!$B$4:$O$6,14,FALSE)))","v":""},{"$f":"IF(M$1019=1,\"\",IF(U759=\"\",\"\",VLOOKUP(U759,Tabelle!$B$4:$Q$6,16,FALSE)))","v":""},null,null,null,null,null,null,null,{"$f":"IF(B759=\"\",0,IF(B759=B758,COUNTIF(B$9:B758,B759)+1,1))","v":747},0,0]
["752","-1900","-1900-748",null,null,null,null,null,null,null,null,null,null,null,null,null,null,null,null,null,null,{"$f":"IF(M$1019=1,\"\",IF(U760=\"\",\"\",VLOOKUP(U760,Tabelle!$B$4:$O$6,14,FALSE)))","v":""},{"$f":"IF(M$1019=1,\"\",IF(U760=\"\",\"\",VLOOKUP(U760,Tabelle!$B$4:$Q$6,16,FALSE)))","v":""},null,null,null,null,null,null,null,{"$f":"IF(B760=\"\",0,IF(B760=B759,COUNTIF(B$9:B759,B760)+1,1))","v":748},0,0]
["753","-1900","-1900-749",null,null,null,null,null,null,null,null,null,null,null,null,null,null,null,null,null,null,{"$f":"IF(M$1019=1,\"\",IF(U761=\"\",\"\",VLOOKUP(U761,Tabelle!$B$4:$O$6,14,FALSE)))","v":""},{"$f":"IF(M$1019=1,\"\",IF(U761=\"\",\"\",VLOOKUP(U761,Tabelle!$B$4:$Q$6,16,FALSE)))","v":""},null,null,null,null,null,null,null,{"$f":"IF(B761=\"\",0,IF(B761=B760,COUNTIF(B$9:B760,B761)+1,1))","v":749},0,0]
["754","-1900","-1900-750",null,null,null,null,null,null,null,null,null,null,null,null,null,null,null,null,null,null,{"$f":"IF(M$1019=1,\"\",IF(U762=\"\",\"\",VLOOKUP(U762,Tabelle!$B$4:$O$6,14,FALSE)))","v":""},{"$f":"IF(M$1019=1,\"\",IF(U762=\"\",\"\",VLOOKUP(U762,Tabelle!$B$4:$Q$6,16,FALSE)))","v":""},null,null,null,null,null,null,null,{"$f":"IF(B762=\"\",0,IF(B762=B761,COUNTIF(B$9:B761,B762)+1,1))","v":750},0,0]
["755","-1900","-1900-751",null,null,null,null,null,null,null,null,null,null,null,null,null,null,null,null,null,null,{"$f":"IF(M$1019=1,\"\",IF(U763=\"\",\"\",VLOOKUP(U763,Tabelle!$B$4:$O$6,14,FALSE)))","v":""},{"$f":"IF(M$1019=1,\"\",IF(U763=\"\",\"\",VLOOKUP(U763,Tabelle!$B$4:$Q$6,16,FALSE)))","v":""},null,null,null,null,null,null,null,{"$f":"IF(B763=\"\",0,IF(B763=B762,COUNTIF(B$9:B762,B763)+1,1))","v":751},0,0]
["756","-1900","-1900-752",null,null,null,null,null,null,null,null,null,null,null,null,null,null,null,null,null,null,{"$f":"IF(M$1019=1,\"\",IF(U764=\"\",\"\",VLOOKUP(U764,Tabelle!$B$4:$O$6,14,FALSE)))","v":""},{"$f":"IF(M$1019=1,\"\",IF(U764=\"\",\"\",VLOOKUP(U764,Tabelle!$B$4:$Q$6,16,FALSE)))","v":""},null,null,null,null,null,null,null,{"$f":"IF(B764=\"\",0,IF(B764=B763,COUNTIF(B$9:B763,B764)+1,1))","v":752},0,0]
["757","-1900","-1900-753",null,null,null,null,null,null,null,null,null,null,null,null,null,null,null,null,null,null,{"$f":"IF(M$1019=1,\"\",IF(U765=\"\",\"\",VLOOKUP(U765,Tabelle!$B$4:$O$6,14,FALSE)))","v":""},{"$f":"IF(M$1019=1,\"\",IF(U765=\"\",\"\",VLOOKUP(U765,Tabelle!$B$4:$Q$6,16,FALSE)))","v":""},null,null,null,null,null,null,null,{"$f":"IF(B765=\"\",0,IF(B765=B764,COUNTIF(B$9:B764,B765)+1,1))","v":753},0,0]
["758","-1900","-1900-754",null,null,null,null,null,null,null,null,null,null,null,null,null,null,null,null,null,null,{"$f":"IF(M$1019=1,\"\",IF(U766=\"\",\"\",VLOOKUP(U766,Tabelle!$B$4:$O$6,14,FALSE)))","v":""},{"$f":"IF(M$1019=1,\"\",IF(U766=\"\",\"\",VLOOKUP(U766,Tabelle!$B$4:$Q$6,16,FALSE)))","v":""},null,null,null,null,null,null,null,{"$f":"IF(B766=\"\",0,IF(B766=B765,COUNTIF(B$9:B765,B766)+1,1))","v":754},0,0]
["759","-1900","-1900-755",null,null,null,null,null,null,null,null,null,null,null,null,null,null,null,null,null,null,{"$f":"IF(M$1019=1,\"\",IF(U767=\"\",\"\",VLOOKUP(U767,Tabelle!$B$4:$O$6,14,FALSE)))","v":""},{"$f":"IF(M$1019=1,\"\",IF(U767=\"\",\"\",VLOOKUP(U767,Tabelle!$B$4:$Q$6,16,FALSE)))","v":""},null,null,null,null,null,null,null,{"$f":"IF(B767=\"\",0,IF(B767=B766,COUNTIF(B$9:B766,B767)+1,1))","v":755},0,0]
["760","-1900","-1900-756",null,null,null,null,null,null,null,null,null,null,null,null,null,null,null,null,null,null,{"$f":"IF(M$1019=1,\"\",IF(U768=\"\",\"\",VLOOKUP(U768,Tabelle!$B$4:$O$6,14,FALSE)))","v":""},{"$f":"IF(M$1019=1,\"\",IF(U768=\"\",\"\",VLOOKUP(U768,Tabelle!$B$4:$Q$6,16,FALSE)))","v":""},null,null,null,null,null,null,null,{"$f":"IF(B768=\"\",0,IF(B768=B767,COUNTIF(B$9:B767,B768)+1,1))","v":756},0,0]
["761","-1900","-1900-757",null,null,null,null,null,null,null,null,null,null,null,null,null,null,null,null,null,null,{"$f":"IF(M$1019=1,\"\",IF(U769=\"\",\"\",VLOOKUP(U769,Tabelle!$B$4:$O$6,14,FALSE)))","v":""},{"$f":"IF(M$1019=1,\"\",IF(U769=\"\",\"\",VLOOKUP(U769,Tabelle!$B$4:$Q$6,16,FALSE)))","v":""},null,null,null,null,null,null,null,{"$f":"IF(B769=\"\",0,IF(B769=B768,COUNTIF(B$9:B768,B769)+1,1))","v":757},0,0]
["762","-1900","-1900-758",null,null,null,null,null,null,null,null,null,null,null,null,null,null,null,null,null,null,{"$f":"IF(M$1019=1,\"\",IF(U770=\"\",\"\",VLOOKUP(U770,Tabelle!$B$4:$O$6,14,FALSE)))","v":""},{"$f":"IF(M$1019=1,\"\",IF(U770=\"\",\"\",VLOOKUP(U770,Tabelle!$B$4:$Q$6,16,FALSE)))","v":""},null,null,null,null,null,null,null,{"$f":"IF(B770=\"\",0,IF(B770=B769,COUNTIF(B$9:B769,B770)+1,1))","v":758},0,0]
["763","-1900","-1900-759",null,null,null,null,null,null,null,null,null,null,null,null,null,null,null,null,null,null,{"$f":"IF(M$1019=1,\"\",IF(U771=\"\",\"\",VLOOKUP(U771,Tabelle!$B$4:$O$6,14,FALSE)))","v":""},{"$f":"IF(M$1019=1,\"\",IF(U771=\"\",\"\",VLOOKUP(U771,Tabelle!$B$4:$Q$6,16,FALSE)))","v":""},null,null,null,null,null,null,null,{"$f":"IF(B771=\"\",0,IF(B771=B770,COUNTIF(B$9:B770,B771)+1,1))","v":759},0,0]
["764","-1900","-1900-760",null,null,null,null,null,null,null,null,null,null,null,null,null,null,null,null,null,null,{"$f":"IF(M$1019=1,\"\",IF(U772=\"\",\"\",VLOOKUP(U772,Tabelle!$B$4:$O$6,14,FALSE)))","v":""},{"$f":"IF(M$1019=1,\"\",IF(U772=\"\",\"\",VLOOKUP(U772,Tabelle!$B$4:$Q$6,16,FALSE)))","v":""},null,null,null,null,null,null,null,{"$f":"IF(B772=\"\",0,IF(B772=B771,COUNTIF(B$9:B771,B772)+1,1))","v":760},0,0]
["765","-1900","-1900-761",null,null,null,null,null,null,null,null,null,null,null,null,null,null,null,null,null,null,{"$f":"IF(M$1019=1,\"\",IF(U773=\"\",\"\",VLOOKUP(U773,Tabelle!$B$4:$O$6,14,FALSE)))","v":""},{"$f":"IF(M$1019=1,\"\",IF(U773=\"\",\"\",VLOOKUP(U773,Tabelle!$B$4:$Q$6,16,FALSE)))","v":""},null,null,null,null,null,null,null,{"$f":"IF(B773=\"\",0,IF(B773=B772,COUNTIF(B$9:B772,B773)+1,1))","v":761},0,0]
["766","-1900","-1900-762",null,null,null,null,null,null,null,null,null,null,null,null,null,null,null,null,null,null,{"$f":"IF(M$1019=1,\"\",IF(U774=\"\",\"\",VLOOKUP(U774,Tabelle!$B$4:$O$6,14,FALSE)))","v":""},{"$f":"IF(M$1019=1,\"\",IF(U774=\"\",\"\",VLOOKUP(U774,Tabelle!$B$4:$Q$6,16,FALSE)))","v":""},null,null,null,null,null,null,null,{"$f":"IF(B774=\"\",0,IF(B774=B773,COUNTIF(B$9:B773,B774)+1,1))","v":762},0,0]
["767","-1900","-1900-763",null,null,null,null,null,null,null,null,null,null,null,null,null,null,null,null,null,null,{"$f":"IF(M$1019=1,\"\",IF(U775=\"\",\"\",VLOOKUP(U775,Tabelle!$B$4:$O$6,14,FALSE)))","v":""},{"$f":"IF(M$1019=1,\"\",IF(U775=\"\",\"\",VLOOKUP(U775,Tabelle!$B$4:$Q$6,16,FALSE)))","v":""},null,null,null,null,null,null,null,{"$f":"IF(B775=\"\",0,IF(B775=B774,COUNTIF(B$9:B774,B775)+1,1))","v":763},0,0]
["768","-1900","-1900-764",null,null,null,null,null,null,null,null,null,null,null,null,null,null,null,null,null,null,{"$f":"IF(M$1019=1,\"\",IF(U776=\"\",\"\",VLOOKUP(U776,Tabelle!$B$4:$O$6,14,FALSE)))","v":""},{"$f":"IF(M$1019=1,\"\",IF(U776=\"\",\"\",VLOOKUP(U776,Tabelle!$B$4:$Q$6,16,FALSE)))","v":""},null,null,null,null,null,null,null,{"$f":"IF(B776=\"\",0,IF(B776=B775,COUNTIF(B$9:B775,B776)+1,1))","v":764},0,0]
["769","-1900","-1900-765",null,null,null,null,null,null,null,null,null,null,null,null,null,null,null,null,null,null,{"$f":"IF(M$1019=1,\"\",IF(U777=\"\",\"\",VLOOKUP(U777,Tabelle!$B$4:$O$6,14,FALSE)))","v":""},{"$f":"IF(M$1019=1,\"\",IF(U777=\"\",\"\",VLOOKUP(U777,Tabelle!$B$4:$Q$6,16,FALSE)))","v":""},null,null,null,null,null,null,null,{"$f":"IF(B777=\"\",0,IF(B777=B776,COUNTIF(B$9:B776,B777)+1,1))","v":765},0,0]
["770",{"$f":"IF(AG778=$AG$1013,0,IF(M$1019=1,0,D778&\"-\"&YEAR(E778)))","v":"-1900"},"-1900-766",null,null,null,null,null,null,null,null,null,null,null,null,null,null,null,null,null,null,{"$f":"IF(M$1019=1,\"\",IF(U778=\"\",\"\",VLOOKUP(U778,Tabelle!$B$4:$O$6,14,FALSE)))","v":""},{"$f":"IF(M$1019=1,\"\",IF(U778=\"\",\"\",VLOOKUP(U778,Tabelle!$B$4:$Q$6,16,FALSE)))","v":""},null,null,null,null,null,null,null,{"$f":"IF(B778=\"\",0,IF(B778=B777,COUNTIF(B$9:B777,B778)+1,1))","v":766},0,{"$f":"IF(E778>0,IF(OR(MONTH(E778)<$L$1030,MONTH(E778)>$L$1031),AG$1013,0),0)","v":0}]
["771","-1900","-1900-767",null,null,null,null,null,null,null,null,null,null,null,null,null,null,null,null,null,null,{"$f":"IF(M$1019=1,\"\",IF(U779=\"\",\"\",VLOOKUP(U779,Tabelle!$B$4:$O$6,14,FALSE)))","v":""},{"$f":"IF(M$1019=1,\"\",IF(U779=\"\",\"\",VLOOKUP(U779,Tabelle!$B$4:$Q$6,16,FALSE)))","v":""},null,null,null,null,null,null,null,{"$f":"IF(B779=\"\",0,IF(B779=B778,COUNTIF(B$9:B778,B779)+1,1))","v":767},0,0]
["772","-1900","-1900-768",null,null,null,null,null,null,null,null,null,null,null,null,null,null,null,null,null,null,{"$f":"IF(M$1019=1,\"\",IF(U780=\"\",\"\",VLOOKUP(U780,Tabelle!$B$4:$O$6,14,FALSE)))","v":""},{"$f":"IF(M$1019=1,\"\",IF(U780=\"\",\"\",VLOOKUP(U780,Tabelle!$B$4:$Q$6,16,FALSE)))","v":""},null,null,null,null,null,null,null,{"$f":"IF(B780=\"\",0,IF(B780=B779,COUNTIF(B$9:B779,B780)+1,1))","v":768},0,0]
["773","-1900","-1900-769",null,null,null,null,null,null,null,null,null,null,null,null,null,null,null,null,null,null,{"$f":"IF(M$1019=1,\"\",IF(U781=\"\",\"\",VLOOKUP(U781,Tabelle!$B$4:$O$6,14,FALSE)))","v":""},{"$f":"IF(M$1019=1,\"\",IF(U781=\"\",\"\",VLOOKUP(U781,Tabelle!$B$4:$Q$6,16,FALSE)))","v":""},null,null,null,null,null,null,null,{"$f":"IF(B781=\"\",0,IF(B781=B780,COUNTIF(B$9:B780,B781)+1,1))","v":769},0,0]
["774","-1900","-1900-770",null,null,null,null,null,null,null,null,null,null,null,null,null,null,null,null,null,null,{"$f":"IF(M$1019=1,\"\",IF(U782=\"\",\"\",VLOOKUP(U782,Tabelle!$B$4:$O$6,14,FALSE)))","v":""},{"$f":"IF(M$1019=1,\"\",IF(U782=\"\",\"\",VLOOKUP(U782,Tabelle!$B$4:$Q$6,16,FALSE)))","v":""},null,null,null,null,null,null,null,{"$f":"IF(B782=\"\",0,IF(B782=B781,COUNTIF(B$9:B781,B782)+1,1))","v":770},0,0]
["775","-1900","-1900-771",null,null,null,null,null,null,null,null,null,null,null,null,null,null,null,null,null,null,{"$f":"IF(M$1019=1,\"\",IF(U783=\"\",\"\",VLOOKUP(U783,Tabelle!$B$4:$O$6,14,FALSE)))","v":""},{"$f":"IF(M$1019=1,\"\",IF(U783=\"\",\"\",VLOOKUP(U783,Tabelle!$B$4:$Q$6,16,FALSE)))","v":""},null,null,null,null,null,null,null,{"$f":"IF(B783=\"\",0,IF(B783=B782,COUNTIF(B$9:B782,B783)+1,1))","v":771},0,0]
["776","-1900","-1900-772",null,null,null,null,null,null,null,null,null,null,null,null,null,null,null,null,null,null,{"$f":"IF(M$1019=1,\"\",IF(U784=\"\",\"\",VLOOKUP(U784,Tabelle!$B$4:$O$6,14,FALSE)))","v":""},{"$f":"IF(M$1019=1,\"\",IF(U784=\"\",\"\",VLOOKUP(U784,Tabelle!$B$4:$Q$6,16,FALSE)))","v":""},null,null,null,null,null,null,null,{"$f":"IF(B784=\"\",0,IF(B784=B783,COUNTIF(B$9:B783,B784)+1,1))","v":772},0,0]
["777","-1900","-1900-773",null,null,null,null,null,null,null,null,null,null,null,null,null,null,null,null,null,null,{"$f":"IF(M$1019=1,\"\",IF(U785=\"\",\"\",VLOOKUP(U785,Tabelle!$B$4:$O$6,14,FALSE)))","v":""},{"$f":"IF(M$1019=1,\"\",IF(U785=\"\",\"\",VLOOKUP(U785,Tabelle!$B$4:$Q$6,16,FALSE)))","v":""},null,null,null,null,null,null,null,{"$f":"IF(B785=\"\",0,IF(B785=B784,COUNTIF(B$9:B784,B785)+1,1))","v":773},0,0]
["778","-1900","-1900-774",null,null,null,null,null,null,null,null,null,null,null,null,null,null,null,null,null,null,{"$f":"IF(M$1019=1,\"\",IF(U786=\"\",\"\",VLOOKUP(U786,Tabelle!$B$4:$O$6,14,FALSE)))","v":""},{"$f":"IF(M$1019=1,\"\",IF(U786=\"\",\"\",VLOOKUP(U786,Tabelle!$B$4:$Q$6,16,FALSE)))","v":""},null,null,null,null,null,null,null,{"$f":"IF(B786=\"\",0,IF(B786=B785,COUNTIF(B$9:B785,B786)+1,1))","v":774},0,0]
["779","-1900","-1900-775",null,null,null,null,null,null,null,null,null,null,null,null,null,null,null,null,null,null,{"$f":"IF(M$1019=1,\"\",IF(U787=\"\",\"\",VLOOKUP(U787,Tabelle!$B$4:$O$6,14,FALSE)))","v":""},{"$f":"IF(M$1019=1,\"\",IF(U787=\"\",\"\",VLOOKUP(U787,Tabelle!$B$4:$Q$6,16,FALSE)))","v":""},null,null,null,null,null,null,null,{"$f":"IF(B787=\"\",0,IF(B787=B786,COUNTIF(B$9:B786,B787)+1,1))","v":775},0,0]
["780","-1900","-1900-776",null,null,null,null,null,null,null,null,null,null,null,null,null,null,null,null,null,null,{"$f":"IF(M$1019=1,\"\",IF(U788=\"\",\"\",VLOOKUP(U788,Tabelle!$B$4:$O$6,14,FALSE)))","v":""},{"$f":"IF(M$1019=1,\"\",IF(U788=\"\",\"\",VLOOKUP(U788,Tabelle!$B$4:$Q$6,16,FALSE)))","v":""},null,null,null,null,null,null,null,{"$f":"IF(B788=\"\",0,IF(B788=B787,COUNTIF(B$9:B787,B788)+1,1))","v":776},{"$f":"IF(OR(D788=\"\",M$1019=1),0,IF(AE788=8,1,0))","v":0},0]
["781","-1900","-1900-777",null,null,null,null,null,null,null,null,null,null,null,null,null,null,null,null,null,null,{"$f":"IF(M$1019=1,\"\",IF(U789=\"\",\"\",VLOOKUP(U789,Tabelle!$B$4:$O$6,14,FALSE)))","v":""},{"$f":"IF(M$1019=1,\"\",IF(U789=\"\",\"\",VLOOKUP(U789,Tabelle!$B$4:$Q$6,16,FALSE)))","v":""},null,null,null,null,null,null,null,{"$f":"IF(B789=\"\",0,IF(B789=B788,COUNTIF(B$9:B788,B789)+1,1))","v":777},0,0]
["782","-1900","-1900-778",null,null,null,null,null,null,null,null,null,null,null,null,null,null,null,null,null,null,{"$f":"IF(M$1019=1,\"\",IF(U790=\"\",\"\",VLOOKUP(U790,Tabelle!$B$4:$O$6,14,FALSE)))","v":""},{"$f":"IF(M$1019=1,\"\",IF(U790=\"\",\"\",VLOOKUP(U790,Tabelle!$B$4:$Q$6,16,FALSE)))","v":""},null,null,null,null,null,null,null,{"$f":"IF(B790=\"\",0,IF(B790=B789,COUNTIF(B$9:B789,B790)+1,1))","v":778},0,0]
["783","-1900","-1900-779",null,null,null,null,null,null,null,null,null,null,null,null,null,null,null,null,null,null,{"$f":"IF(M$1019=1,\"\",IF(U791=\"\",\"\",VLOOKUP(U791,Tabelle!$B$4:$O$6,14,FALSE)))","v":""},{"$f":"IF(M$1019=1,\"\",IF(U791=\"\",\"\",VLOOKUP(U791,Tabelle!$B$4:$Q$6,16,FALSE)))","v":""},null,null,null,null,null,null,null,{"$f":"IF(B791=\"\",0,IF(B791=B790,COUNTIF(B$9:B790,B791)+1,1))","v":779},0,0]
["784","-1900","-1900-780",null,null,null,null,null,null,null,null,null,null,null,null,null,null,null,null,null,null,{"$f":"IF(M$1019=1,\"\",IF(U792=\"\",\"\",VLOOKUP(U792,Tabelle!$B$4:$O$6,14,FALSE)))","v":""},{"$f":"IF(M$1019=1,\"\",IF(U792=\"\",\"\",VLOOKUP(U792,Tabelle!$B$4:$Q$6,16,FALSE)))","v":""},null,null,null,null,null,null,null,{"$f":"IF(B792=\"\",0,IF(B792=B791,COUNTIF(B$9:B791,B792)+1,1))","v":780},0,0]
["785","-1900","-1900-781",null,null,null,null,null,null,null,null,null,null,null,null,null,null,null,null,null,null,{"$f":"IF(M$1019=1,\"\",IF(U793=\"\",\"\",VLOOKUP(U793,Tabelle!$B$4:$O$6,14,FALSE)))","v":""},{"$f":"IF(M$1019=1,\"\",IF(U793=\"\",\"\",VLOOKUP(U793,Tabelle!$B$4:$Q$6,16,FALSE)))","v":""},null,null,null,null,null,null,null,{"$f":"IF(B793=\"\",0,IF(B793=B792,COUNTIF(B$9:B792,B793)+1,1))","v":781},0,0]
["786","-1900","-1900-782",null,null,null,null,null,null,null,null,null,null,null,null,null,null,null,null,null,null,{"$f":"IF(M$1019=1,\"\",IF(U794=\"\",\"\",VLOOKUP(U794,Tabelle!$B$4:$O$6,14,FALSE)))","v":""},{"$f":"IF(M$1019=1,\"\",IF(U794=\"\",\"\",VLOOKUP(U794,Tabelle!$B$4:$Q$6,16,FALSE)))","v":""},null,null,null,null,null,null,null,{"$f":"IF(B794=\"\",0,IF(B794=B793,COUNTIF(B$9:B793,B794)+1,1))","v":782},0,0]
["787","-1900","-1900-783",null,null,null,null,null,null,null,null,null,null,null,null,null,null,null,null,null,null,{"$f":"IF(M$1019=1,\"\",IF(U795=\"\",\"\",VLOOKUP(U795,Tabelle!$B$4:$O$6,14,FALSE)))","v":""},{"$f":"IF(M$1019=1,\"\",IF(U795=\"\",\"\",VLOOKUP(U795,Tabelle!$B$4:$Q$6,16,FALSE)))","v":""},null,null,null,null,null,null,null,{"$f":"IF(B795=\"\",0,IF(B795=B794,COUNTIF(B$9:B794,B795)+1,1))","v":783},0,0]
["788","-1900","-1900-784",null,null,null,null,null,null,null,null,null,null,null,null,null,null,null,null,null,null,{"$f":"IF(M$1019=1,\"\",IF(U796=\"\",\"\",VLOOKUP(U796,Tabelle!$B$4:$O$6,14,FALSE)))","v":""},{"$f":"IF(M$1019=1,\"\",IF(U796=\"\",\"\",VLOOKUP(U796,Tabelle!$B$4:$Q$6,16,FALSE)))","v":""},null,null,null,null,null,null,null,{"$f":"IF(B796=\"\",0,IF(B796=B795,COUNTIF(B$9:B795,B796)+1,1))","v":784},0,0]
["789","-1900","-1900-785",null,null,null,null,null,null,null,null,null,null,null,null,null,null,null,null,null,null,{"$f":"IF(M$1019=1,\"\",IF(U797=\"\",\"\",VLOOKUP(U797,Tabelle!$B$4:$O$6,14,FALSE)))","v":""},{"$f":"IF(M$1019=1,\"\",IF(U797=\"\",\"\",VLOOKUP(U797,Tabelle!$B$4:$Q$6,16,FALSE)))","v":""},null,null,null,null,null,null,null,{"$f":"IF(B797=\"\",0,IF(B797=B796,COUNTIF(B$9:B796,B797)+1,1))","v":785},0,0]
["790","-1900","-1900-786",null,null,null,null,null,null,null,null,null,null,null,null,null,null,null,null,null,null,{"$f":"IF(M$1019=1,\"\",IF(U798=\"\",\"\",VLOOKUP(U798,Tabelle!$B$4:$O$6,14,FALSE)))","v":""},{"$f":"IF(M$1019=1,\"\",IF(U798=\"\",\"\",VLOOKUP(U798,Tabelle!$B$4:$Q$6,16,FALSE)))","v":""},null,null,null,null,null,null,null,{"$f":"IF(B798=\"\",0,IF(B798=B797,COUNTIF(B$9:B797,B798)+1,1))","v":786},0,0]
["791","-1900","-1900-787",null,null,null,null,null,null,null,null,null,null,null,null,null,null,null,null,null,null,{"$f":"IF(M$1019=1,\"\",IF(U799=\"\",\"\",VLOOKUP(U799,Tabelle!$B$4:$O$6,14,FALSE)))","v":""},{"$f":"IF(M$1019=1,\"\",IF(U799=\"\",\"\",VLOOKUP(U799,Tabelle!$B$4:$Q$6,16,FALSE)))","v":""},null,null,null,null,null,null,null,{"$f":"IF(B799=\"\",0,IF(B799=B798,COUNTIF(B$9:B798,B799)+1,1))","v":787},0,0]
["792","-1900","-1900-788",null,null,null,null,null,null,null,null,null,null,null,null,null,null,null,null,null,null,{"$f":"IF(M$1019=1,\"\",IF(U800=\"\",\"\",VLOOKUP(U800,Tabelle!$B$4:$O$6,14,FALSE)))","v":""},{"$f":"IF(M$1019=1,\"\",IF(U800=\"\",\"\",VLOOKUP(U800,Tabelle!$B$4:$Q$6,16,FALSE)))","v":""},null,null,null,null,null,null,null,{"$f":"IF(B800=\"\",0,IF(B800=B799,COUNTIF(B$9:B799,B800)+1,1))","v":788},0,0]
["793","-1900","-1900-789",null,null,null,null,null,null,null,null,null,null,null,null,null,null,null,null,null,null,{"$f":"IF(M$1019=1,\"\",IF(U801=\"\",\"\",VLOOKUP(U801,Tabelle!$B$4:$O$6,14,FALSE)))","v":""},{"$f":"IF(M$1019=1,\"\",IF(U801=\"\",\"\",VLOOKUP(U801,Tabelle!$B$4:$Q$6,16,FALSE)))","v":""},null,null,null,null,null,null,null,{"$f":"IF(B801=\"\",0,IF(B801=B800,COUNTIF(B$9:B800,B801)+1,1))","v":789},0,0]
["794","-1900","-1900-790",null,null,null,null,null,null,null,null,null,null,null,null,null,null,null,null,null,null,{"$f":"IF(M$1019=1,\"\",IF(U802=\"\",\"\",VLOOKUP(U802,Tabelle!$B$4:$O$6,14,FALSE)))","v":""},{"$f":"IF(M$1019=1,\"\",IF(U802=\"\",\"\",VLOOKUP(U802,Tabelle!$B$4:$Q$6,16,FALSE)))","v":""},null,null,null,null,null,null,null,{"$f":"IF(B802=\"\",0,IF(B802=B801,COUNTIF(B$9:B801,B802)+1,1))","v":790},0,0]
["795","-1900","-1900-791",null,null,null,null,null,null,null,null,null,null,null,null,null,null,null,null,null,null,{"$f":"IF(M$1019=1,\"\",IF(U803=\"\",\"\",VLOOKUP(U803,Tabelle!$B$4:$O$6,14,FALSE)))","v":""},{"$f":"IF(M$1019=1,\"\",IF(U803=\"\",\"\",VLOOKUP(U803,Tabelle!$B$4:$Q$6,16,FALSE)))","v":""},null,null,null,null,null,null,null,{"$f":"IF(B803=\"\",0,IF(B803=B802,COUNTIF(B$9:B802,B803)+1,1))","v":791},0,0]
["796","-1900","-1900-792",null,null,null,null,null,null,null,null,null,null,null,null,null,null,null,null,null,null,{"$f":"IF(M$1019=1,\"\",IF(U804=\"\",\"\",VLOOKUP(U804,Tabelle!$B$4:$O$6,14,FALSE)))","v":""},{"$f":"IF(M$1019=1,\"\",IF(U804=\"\",\"\",VLOOKUP(U804,Tabelle!$B$4:$Q$6,16,FALSE)))","v":""},null,null,null,null,null,null,null,{"$f":"IF(B804=\"\",0,IF(B804=B803,COUNTIF(B$9:B803,B804)+1,1))","v":792},0,0]
["797","-1900","-1900-793",null,null,null,null,null,null,null,null,null,null,null,null,null,null,null,null,null,null,{"$f":"IF(M$1019=1,\"\",IF(U805=\"\",\"\",VLOOKUP(U805,Tabelle!$B$4:$O$6,14,FALSE)))","v":""},{"$f":"IF(M$1019=1,\"\",IF(U805=\"\",\"\",VLOOKUP(U805,Tabelle!$B$4:$Q$6,16,FALSE)))","v":""},null,null,null,null,null,null,null,{"$f":"IF(B805=\"\",0,IF(B805=B804,COUNTIF(B$9:B804,B805)+1,1))","v":793},0,0]
["798","-1900","-1900-794",null,null,null,null,null,null,null,null,null,null,null,null,null,null,null,null,null,null,{"$f":"IF(M$1019=1,\"\",IF(U806=\"\",\"\",VLOOKUP(U806,Tabelle!$B$4:$O$6,14,FALSE)))","v":""},{"$f":"IF(M$1019=1,\"\",IF(U806=\"\",\"\",VLOOKUP(U806,Tabelle!$B$4:$Q$6,16,FALSE)))","v":""},null,null,null,null,null,null,null,{"$f":"IF(B806=\"\",0,IF(B806=B805,COUNTIF(B$9:B805,B806)+1,1))","v":794},0,0]
["799","-1900","-1900-795",null,null,null,null,null,null,null,null,null,null,null,null,null,null,null,null,null,null,{"$f":"IF(M$1019=1,\"\",IF(U807=\"\",\"\",VLOOKUP(U807,Tabelle!$B$4:$O$6,14,FALSE)))","v":""},{"$f":"IF(M$1019=1,\"\",IF(U807=\"\",\"\",VLOOKUP(U807,Tabelle!$B$4:$Q$6,16,FALSE)))","v":""},null,null,null,null,null,null,null,{"$f":"IF(B807=\"\",0,IF(B807=B806,COUNTIF(B$9:B806,B807)+1,1))","v":795},0,0]
["800","-1900","-1900-796",null,null,null,null,null,null,null,null,null,null,null,null,null,null,null,null,null,null,{"$f":"IF(M$1019=1,\"\",IF(U808=\"\",\"\",VLOOKUP(U808,Tabelle!$B$4:$O$6,14,FALSE)))","v":""},{"$f":"IF(M$1019=1,\"\",IF(U808=\"\",\"\",VLOOKUP(U808,Tabelle!$B$4:$Q$6,16,FALSE)))","v":""},null,null,null,null,null,null,null,{"$f":"IF(B808=\"\",0,IF(B808=B807,COUNTIF(B$9:B807,B808)+1,1))","v":796},0,0]
["801","-1900","-1900-797",null,null,null,null,null,null,null,null,null,null,null,null,null,null,null,null,null,null,{"$f":"IF(M$1019=1,\"\",IF(U809=\"\",\"\",VLOOKUP(U809,Tabelle!$B$4:$O$6,14,FALSE)))","v":""},{"$f":"IF(M$1019=1,\"\",IF(U809=\"\",\"\",VLOOKUP(U809,Tabelle!$B$4:$Q$6,16,FALSE)))","v":""},null,null,null,null,null,null,null,{"$f":"IF(B809=\"\",0,IF(B809=B808,COUNTIF(B$9:B808,B809)+1,1))","v":797},0,0]
["802","-1900","-1900-798",null,null,null,null,null,null,null,null,null,null,null,null,null,null,null,null,null,null,{"$f":"IF(M$1019=1,\"\",IF(U810=\"\",\"\",VLOOKUP(U810,Tabelle!$B$4:$O$6,14,FALSE)))","v":""},{"$f":"IF(M$1019=1,\"\",IF(U810=\"\",\"\",VLOOKUP(U810,Tabelle!$B$4:$Q$6,16,FALSE)))","v":""},null,null,null,null,null,null,null,{"$f":"IF(B810=\"\",0,IF(B810=B809,COUNTIF(B$9:B809,B810)+1,1))","v":798},0,0]
["803","-1900","-1900-799",null,null,null,null,null,null,null,null,null,null,null,null,null,null,null,null,null,null,{"$f":"IF(M$1019=1,\"\",IF(U811=\"\",\"\",VLOOKUP(U811,Tabelle!$B$4:$O$6,14,FALSE)))","v":""},{"$f":"IF(M$1019=1,\"\",IF(U811=\"\",\"\",VLOOKUP(U811,Tabelle!$B$4:$Q$6,16,FALSE)))","v":""},null,null,null,null,null,null,null,{"$f":"IF(B811=\"\",0,IF(B811=B810,COUNTIF(B$9:B810,B811)+1,1))","v":799},0,0]
["804","-1900","-1900-800",null,null,null,null,null,null,null,null,null,null,null,null,null,null,null,null,null,null,{"$f":"IF(M$1019=1,\"\",IF(U812=\"\",\"\",VLOOKUP(U812,Tabelle!$B$4:$O$6,14,FALSE)))","v":""},{"$f":"IF(M$1019=1,\"\",IF(U812=\"\",\"\",VLOOKUP(U812,Tabelle!$B$4:$Q$6,16,FALSE)))","v":""},null,null,null,null,null,null,null,{"$f":"IF(B812=\"\",0,IF(B812=B811,COUNTIF(B$9:B811,B812)+1,1))","v":800},0,0]
["805","-1900","-1900-801",null,null,null,null,null,null,null,null,null,null,null,null,null,null,null,null,null,null,{"$f":"IF(M$1019=1,\"\",IF(U813=\"\",\"\",VLOOKUP(U813,Tabelle!$B$4:$O$6,14,FALSE)))","v":""},{"$f":"IF(M$1019=1,\"\",IF(U813=\"\",\"\",VLOOKUP(U813,Tabelle!$B$4:$Q$6,16,FALSE)))","v":""},null,null,null,null,null,null,null,{"$f":"IF(B813=\"\",0,IF(B813=B812,COUNTIF(B$9:B812,B813)+1,1))","v":801},0,0]
["806","-1900","-1900-802",null,null,null,null,null,null,null,null,null,null,null,null,null,null,null,null,null,null,{"$f":"IF(M$1019=1,\"\",IF(U814=\"\",\"\",VLOOKUP(U814,Tabelle!$B$4:$O$6,14,FALSE)))","v":""},{"$f":"IF(M$1019=1,\"\",IF(U814=\"\",\"\",VLOOKUP(U814,Tabelle!$B$4:$Q$6,16,FALSE)))","v":""},null,null,null,null,null,null,null,{"$f":"IF(B814=\"\",0,IF(B814=B813,COUNTIF(B$9:B813,B814)+1,1))","v":802},0,0]
["807","-1900","-1900-803",null,null,null,null,null,null,null,null,null,null,null,null,null,null,null,null,null,null,{"$f":"IF(M$1019=1,\"\",IF(U815=\"\",\"\",VLOOKUP(U815,Tabelle!$B$4:$O$6,14,FALSE)))","v":""},{"$f":"IF(M$1019=1,\"\",IF(U815=\"\",\"\",VLOOKUP(U815,Tabelle!$B$4:$Q$6,16,FALSE)))","v":""},null,null,null,null,null,null,null,{"$f":"IF(B815=\"\",0,IF(B815=B814,COUNTIF(B$9:B814,B815)+1,1))","v":803},0,0]
["808","-1900","-1900-804",null,null,null,null,null,null,null,null,null,null,null,null,null,null,null,null,null,null,{"$f":"IF(M$1019=1,\"\",IF(U816=\"\",\"\",VLOOKUP(U816,Tabelle!$B$4:$O$6,14,FALSE)))","v":""},{"$f":"IF(M$1019=1,\"\",IF(U816=\"\",\"\",VLOOKUP(U816,Tabelle!$B$4:$Q$6,16,FALSE)))","v":""},null,null,null,null,null,null,null,{"$f":"IF(B816=\"\",0,IF(B816=B815,COUNTIF(B$9:B815,B816)+1,1))","v":804},0,0]
["809","-1900","-1900-805",null,null,null,null,null,null,null,null,null,null,null,null,null,null,null,null,null,null,{"$f":"IF(M$1019=1,\"\",IF(U817=\"\",\"\",VLOOKUP(U817,Tabelle!$B$4:$O$6,14,FALSE)))","v":""},{"$f":"IF(M$1019=1,\"\",IF(U817=\"\",\"\",VLOOKUP(U817,Tabelle!$B$4:$Q$6,16,FALSE)))","v":""},null,null,null,null,null,null,null,{"$f":"IF(B817=\"\",0,IF(B817=B816,COUNTIF(B$9:B816,B817)+1,1))","v":805},0,0]
["810","-1900","-1900-806",null,null,null,null,null,null,null,null,null,null,null,null,null,null,null,null,null,null,{"$f":"IF(M$1019=1,\"\",IF(U818=\"\",\"\",VLOOKUP(U818,Tabelle!$B$4:$O$6,14,FALSE)))","v":""},{"$f":"IF(M$1019=1,\"\",IF(U818=\"\",\"\",VLOOKUP(U818,Tabelle!$B$4:$Q$6,16,FALSE)))","v":""},null,null,null,null,null,null,null,{"$f":"IF(B818=\"\",0,IF(B818=B817,COUNTIF(B$9:B817,B818)+1,1))","v":806},0,0]
["811","-1900",{"$f":"IF(M$1019=1,0,B819&\"-\"&AE819)","v":"-1900-807"},null,null,null,null,null,null,null,null,null,null,null,null,null,null,null,null,null,null,{"$f":"IF(M$1019=1,\"\",IF(U819=\"\",\"\",VLOOKUP(U819,Tabelle!$B$4:$O$6,14,FALSE)))","v":""},{"$f":"IF(M$1019=1,\"\",IF(U819=\"\",\"\",VLOOKUP(U819,Tabelle!$B$4:$Q$6,16,FALSE)))","v":""},null,null,null,null,null,null,null,{"$f":"IF(B819=\"\",0,IF(B819=B818,COUNTIF(B$9:B818,B819)+1,1))","v":807},0,0]
["812","-1900","-1900-808",null,null,null,null,null,null,null,null,null,null,null,null,null,null,null,null,null,null,{"$f":"IF(M$1019=1,\"\",IF(U820=\"\",\"\",VLOOKUP(U820,Tabelle!$B$4:$O$6,14,FALSE)))","v":""},{"$f":"IF(M$1019=1,\"\",IF(U820=\"\",\"\",VLOOKUP(U820,Tabelle!$B$4:$Q$6,16,FALSE)))","v":""},null,null,null,null,null,null,null,{"$f":"IF(B820=\"\",0,IF(B820=B819,COUNTIF(B$9:B819,B820)+1,1))","v":808},0,0]
["813","-1900","-1900-809",null,null,null,null,null,null,null,null,null,null,null,null,null,null,null,null,null,null,{"$f":"IF(M$1019=1,\"\",IF(U821=\"\",\"\",VLOOKUP(U821,Tabelle!$B$4:$O$6,14,FALSE)))","v":""},{"$f":"IF(M$1019=1,\"\",IF(U821=\"\",\"\",VLOOKUP(U821,Tabelle!$B$4:$Q$6,16,FALSE)))","v":""},null,null,null,null,null,null,null,{"$f":"IF(B821=\"\",0,IF(B821=B820,COUNTIF(B$9:B820,B821)+1,1))","v":809},0,0]
["814","-1900","-1900-810",null,null,null,null,null,null,null,null,null,null,null,null,null,null,null,null,null,null,{"$f":"IF(M$1019=1,\"\",IF(U822=\"\",\"\",VLOOKUP(U822,Tabelle!$B$4:$O$6,14,FALSE)))","v":""},{"$f":"IF(M$1019=1,\"\",IF(U822=\"\",\"\",VLOOKUP(U822,Tabelle!$B$4:$Q$6,16,FALSE)))","v":""},null,null,null,null,null,null,null,{"$f":"IF(B822=\"\",0,IF(B822=B821,COUNTIF(B$9:B821,B822)+1,1))","v":810},0,0]
["815","-1900","-1900-811",null,null,null,null,null,null,null,null,null,null,null,null,null,null,null,null,null,null,{"$f":"IF(M$1019=1,\"\",IF(U823=\"\",\"\",VLOOKUP(U823,Tabelle!$B$4:$O$6,14,FALSE)))","v":""},{"$f":"IF(M$1019=1,\"\",IF(U823=\"\",\"\",VLOOKUP(U823,Tabelle!$B$4:$Q$6,16,FALSE)))","v":""},null,null,null,null,null,null,null,{"$f":"IF(B823=\"\",0,IF(B823=B822,COUNTIF(B$9:B822,B823)+1,1))","v":811},0,0]
["816","-1900","-1900-812",null,null,null,null,null,null,null,null,null,null,null,null,null,null,null,null,null,null,{"$f":"IF(M$1019=1,\"\",IF(U824=\"\",\"\",VLOOKUP(U824,Tabelle!$B$4:$O$6,14,FALSE)))","v":""},{"$f":"IF(M$1019=1,\"\",IF(U824=\"\",\"\",VLOOKUP(U824,Tabelle!$B$4:$Q$6,16,FALSE)))","v":""},null,null,null,null,null,null,null,{"$f":"IF(B824=\"\",0,IF(B824=B823,COUNTIF(B$9:B823,B824)+1,1))","v":812},0,0]
["817","-1900","-1900-813",null,null,null,null,null,null,null,null,null,null,null,null,null,null,null,null,null,null,{"$f":"IF(M$1019=1,\"\",IF(U825=\"\",\"\",VLOOKUP(U825,Tabelle!$B$4:$O$6,14,FALSE)))","v":""},{"$f":"IF(M$1019=1,\"\",IF(U825=\"\",\"\",VLOOKUP(U825,Tabelle!$B$4:$Q$6,16,FALSE)))","v":""},null,null,null,null,null,null,null,{"$f":"IF(B825=\"\",0,IF(B825=B824,COUNTIF(B$9:B824,B825)+1,1))","v":813},0,0]
["818","-1900","-1900-814",null,null,null,null,null,null,null,null,null,null,null,null,null,null,null,null,null,null,{"$f":"IF(M$1019=1,\"\",IF(U826=\"\",\"\",VLOOKUP(U826,Tabelle!$B$4:$O$6,14,FALSE)))","v":""},{"$f":"IF(M$1019=1,\"\",IF(U826=\"\",\"\",VLOOKUP(U826,Tabelle!$B$4:$Q$6,16,FALSE)))","v":""},null,null,null,null,null,null,null,{"$f":"IF(B826=\"\",0,IF(B826=B825,COUNTIF(B$9:B825,B826)+1,1))","v":814},0,0]
["819","-1900","-1900-815",null,null,null,null,null,null,null,null,null,null,null,null,null,null,null,null,null,null,{"$f":"IF(M$1019=1,\"\",IF(U827=\"\",\"\",VLOOKUP(U827,Tabelle!$B$4:$O$6,14,FALSE)))","v":""},{"$f":"IF(M$1019=1,\"\",IF(U827=\"\",\"\",VLOOKUP(U827,Tabelle!$B$4:$Q$6,16,FALSE)))","v":""},null,null,null,null,null,null,null,{"$f":"IF(B827=\"\",0,IF(B827=B826,COUNTIF(B$9:B826,B827)+1,1))","v":815},0,0]
["820","-1900","-1900-816",null,null,null,null,null,null,null,null,null,null,null,null,null,null,null,null,null,null,{"$f":"IF(M$1019=1,\"\",IF(U828=\"\",\"\",VLOOKUP(U828,Tabelle!$B$4:$O$6,14,FALSE)))","v":""},{"$f":"IF(M$1019=1,\"\",IF(U828=\"\",\"\",VLOOKUP(U828,Tabelle!$B$4:$Q$6,16,FALSE)))","v":""},null,null,null,null,null,null,null,{"$f":"IF(B828=\"\",0,IF(B828=B827,COUNTIF(B$9:B827,B828)+1,1))","v":816},0,0]
["821","-1900","-1900-817",null,null,null,null,null,null,null,null,null,null,null,null,null,null,null,null,null,null,{"$f":"IF(M$1019=1,\"\",IF(U829=\"\",\"\",VLOOKUP(U829,Tabelle!$B$4:$O$6,14,FALSE)))","v":""},{"$f":"IF(M$1019=1,\"\",IF(U829=\"\",\"\",VLOOKUP(U829,Tabelle!$B$4:$Q$6,16,FALSE)))","v":""},null,null,null,null,null,null,null,{"$f":"IF(B829=\"\",0,IF(B829=B828,COUNTIF(B$9:B828,B829)+1,1))","v":817},0,0]
["822","-1900","-1900-818",null,null,null,null,null,null,null,null,null,null,null,null,null,null,null,null,null,null,{"$f":"IF(M$1019=1,\"\",IF(U830=\"\",\"\",VLOOKUP(U830,Tabelle!$B$4:$O$6,14,FALSE)))","v":""},{"$f":"IF(M$1019=1,\"\",IF(U830=\"\",\"\",VLOOKUP(U830,Tabelle!$B$4:$Q$6,16,FALSE)))","v":""},null,null,null,null,null,null,null,{"$f":"IF(B830=\"\",0,IF(B830=B829,COUNTIF(B$9:B829,B830)+1,1))","v":818},0,0]
["823","-1900","-1900-819",null,null,null,null,null,null,null,null,null,null,null,null,null,null,null,null,null,null,{"$f":"IF(M$1019=1,\"\",IF(U831=\"\",\"\",VLOOKUP(U831,Tabelle!$B$4:$O$6,14,FALSE)))","v":""},{"$f":"IF(M$1019=1,\"\",IF(U831=\"\",\"\",VLOOKUP(U831,Tabelle!$B$4:$Q$6,16,FALSE)))","v":""},null,null,null,null,null,null,null,{"$f":"IF(B831=\"\",0,IF(B831=B830,COUNTIF(B$9:B830,B831)+1,1))","v":819},0,0]
["824","-1900","-1900-820",null,null,null,null,null,null,null,null,null,null,null,null,null,null,null,null,null,null,{"$f":"IF(M$1019=1,\"\",IF(U832=\"\",\"\",VLOOKUP(U832,Tabelle!$B$4:$O$6,14,FALSE)))","v":""},{"$f":"IF(M$1019=1,\"\",IF(U832=\"\",\"\",VLOOKUP(U832,Tabelle!$B$4:$Q$6,16,FALSE)))","v":""},null,null,null,null,null,null,null,{"$f":"IF(B832=\"\",0,IF(B832=B831,COUNTIF(B$9:B831,B832)+1,1))","v":820},0,0]
["825","-1900","-1900-821",null,null,null,null,null,null,null,null,null,null,null,null,null,null,null,null,null,null,{"$f":"IF(M$1019=1,\"\",IF(U833=\"\",\"\",VLOOKUP(U833,Tabelle!$B$4:$O$6,14,FALSE)))","v":""},{"$f":"IF(M$1019=1,\"\",IF(U833=\"\",\"\",VLOOKUP(U833,Tabelle!$B$4:$Q$6,16,FALSE)))","v":""},null,null,null,null,null,null,null,{"$f":"IF(B833=\"\",0,IF(B833=B832,COUNTIF(B$9:B832,B833)+1,1))","v":821},0,0]
["826","-1900","-1900-822",null,null,null,null,null,null,null,null,null,null,null,null,null,null,null,null,null,null,{"$f":"IF(M$1019=1,\"\",IF(U834=\"\",\"\",VLOOKUP(U834,Tabelle!$B$4:$O$6,14,FALSE)))","v":""},{"$f":"IF(M$1019=1,\"\",IF(U834=\"\",\"\",VLOOKUP(U834,Tabelle!$B$4:$Q$6,16,FALSE)))","v":""},null,null,null,null,null,null,null,{"$f":"IF(B834=\"\",0,IF(B834=B833,COUNTIF(B$9:B833,B834)+1,1))","v":822},0,0]
["827","-1900","-1900-823",null,null,null,null,null,null,null,null,null,null,null,null,null,null,null,null,null,null,{"$f":"IF(M$1019=1,\"\",IF(U835=\"\",\"\",VLOOKUP(U835,Tabelle!$B$4:$O$6,14,FALSE)))","v":""},{"$f":"IF(M$1019=1,\"\",IF(U835=\"\",\"\",VLOOKUP(U835,Tabelle!$B$4:$Q$6,16,FALSE)))","v":""},null,null,null,null,null,null,null,{"$f":"IF(B835=\"\",0,IF(B835=B834,COUNTIF(B$9:B834,B835)+1,1))","v":823},0,0]
["828","-1900","-1900-824",null,null,null,null,null,null,null,null,null,null,null,null,null,null,null,null,null,null,{"$f":"IF(M$1019=1,\"\",IF(U836=\"\",\"\",VLOOKUP(U836,Tabelle!$B$4:$O$6,14,FALSE)))","v":""},{"$f":"IF(M$1019=1,\"\",IF(U836=\"\",\"\",VLOOKUP(U836,Tabelle!$B$4:$Q$6,16,FALSE)))","v":""},null,null,null,null,null,null,null,{"$f":"IF(B836=\"\",0,IF(B836=B835,COUNTIF(B$9:B835,B836)+1,1))","v":824},0,0]
["829","-1900","-1900-825",null,null,null,null,null,null,null,null,null,null,null,null,null,null,null,null,null,null,{"$f":"IF(M$1019=1,\"\",IF(U837=\"\",\"\",VLOOKUP(U837,Tabelle!$B$4:$O$6,14,FALSE)))","v":""},{"$f":"IF(M$1019=1,\"\",IF(U837=\"\",\"\",VLOOKUP(U837,Tabelle!$B$4:$Q$6,16,FALSE)))","v":""},null,null,null,null,null,null,null,{"$f":"IF(B837=\"\",0,IF(B837=B836,COUNTIF(B$9:B836,B837)+1,1))","v":825},0,0]
["830","-1900","-1900-826",null,null,null,null,null,null,null,null,null,null,null,null,null,null,null,null,null,null,{"$f":"IF(M$1019=1,\"\",IF(U838=\"\",\"\",VLOOKUP(U838,Tabelle!$B$4:$O$6,14,FALSE)))","v":""},{"$f":"IF(M$1019=1,\"\",IF(U838=\"\",\"\",VLOOKUP(U838,Tabelle!$B$4:$Q$6,16,FALSE)))","v":""},null,null,null,null,null,null,null,{"$f":"IF(B838=\"\",0,IF(B838=B837,COUNTIF(B$9:B837,B838)+1,1))","v":826},0,0]
["831","-1900","-1900-827",null,null,null,null,null,null,null,null,null,null,null,null,null,null,null,null,null,null,{"$f":"IF(M$1019=1,\"\",IF(U839=\"\",\"\",VLOOKUP(U839,Tabelle!$B$4:$O$6,14,FALSE)))","v":""},{"$f":"IF(M$1019=1,\"\",IF(U839=\"\",\"\",VLOOKUP(U839,Tabelle!$B$4:$Q$6,16,FALSE)))","v":""},null,null,null,null,null,null,null,{"$f":"IF(B839=\"\",0,IF(B839=B838,COUNTIF(B$9:B838,B839)+1,1))","v":827},0,0]
["832","-1900","-1900-828",null,null,null,null,null,null,null,null,null,null,null,null,null,null,null,null,null,null,{"$f":"IF(M$1019=1,\"\",IF(U840=\"\",\"\",VLOOKUP(U840,Tabelle!$B$4:$O$6,14,FALSE)))","v":""},{"$f":"IF(M$1019=1,\"\",IF(U840=\"\",\"\",VLOOKUP(U840,Tabelle!$B$4:$Q$6,16,FALSE)))","v":""},null,null,null,null,null,null,null,{"$f":"IF(B840=\"\",0,IF(B840=B839,COUNTIF(B$9:B839,B840)+1,1))","v":828},0,0]
["833","-1900","-1900-829",null,null,null,null,null,null,null,null,null,null,null,null,null,null,null,null,null,null,{"$f":"IF(M$1019=1,\"\",IF(U841=\"\",\"\",VLOOKUP(U841,Tabelle!$B$4:$O$6,14,FALSE)))","v":""},{"$f":"IF(M$1019=1,\"\",IF(U841=\"\",\"\",VLOOKUP(U841,Tabelle!$B$4:$Q$6,16,FALSE)))","v":""},null,null,null,null,null,null,null,{"$f":"IF(B841=\"\",0,IF(B841=B840,COUNTIF(B$9:B840,B841)+1,1))","v":829},0,0]
["834",{"$f":"IF(AG842=$AG$1013,0,IF(M$1019=1,0,D842&\"-\"&YEAR(E842)))","v":"-1900"},"-1900-830",null,null,null,null,null,null,null,null,null,null,null,null,null,null,null,null,null,null,{"$f":"IF(M$1019=1,\"\",IF(U842=\"\",\"\",VLOOKUP(U842,Tabelle!$B$4:$O$6,14,FALSE)))","v":""},{"$f":"IF(M$1019=1,\"\",IF(U842=\"\",\"\",VLOOKUP(U842,Tabelle!$B$4:$Q$6,16,FALSE)))","v":""},null,null,null,null,null,null,null,{"$f":"IF(B842=\"\",0,IF(B842=B841,COUNTIF(B$9:B841,B842)+1,1))","v":830},0,{"$f":"IF(E842>0,IF(OR(MONTH(E842)<$L$1030,MONTH(E842)>$L$1031),AG$1013,0),0)","v":0}]
["835","-1900","-1900-831",null,null,null,null,null,null,null,null,null,null,null,null,null,null,null,null,null,null,{"$f":"IF(M$1019=1,\"\",IF(U843=\"\",\"\",VLOOKUP(U843,Tabelle!$B$4:$O$6,14,FALSE)))","v":""},{"$f":"IF(M$1019=1,\"\",IF(U843=\"\",\"\",VLOOKUP(U843,Tabelle!$B$4:$Q$6,16,FALSE)))","v":""},null,null,null,null,null,null,null,{"$f":"IF(B843=\"\",0,IF(B843=B842,COUNTIF(B$9:B842,B843)+1,1))","v":831},0,0]
["836","-1900","-1900-832",null,null,null,null,null,null,null,null,null,null,null,null,null,null,null,null,null,null,{"$f":"IF(M$1019=1,\"\",IF(U844=\"\",\"\",VLOOKUP(U844,Tabelle!$B$4:$O$6,14,FALSE)))","v":""},{"$f":"IF(M$1019=1,\"\",IF(U844=\"\",\"\",VLOOKUP(U844,Tabelle!$B$4:$Q$6,16,FALSE)))","v":""},null,null,null,null,null,null,null,{"$f":"IF(B844=\"\",0,IF(B844=B843,COUNTIF(B$9:B843,B844)+1,1))","v":832},0,0]
["837","-1900","-1900-833",null,null,null,null,null,null,null,null,null,null,null,null,null,null,null,null,null,null,{"$f":"IF(M$1019=1,\"\",IF(U845=\"\",\"\",VLOOKUP(U845,Tabelle!$B$4:$O$6,14,FALSE)))","v":""},{"$f":"IF(M$1019=1,\"\",IF(U845=\"\",\"\",VLOOKUP(U845,Tabelle!$B$4:$Q$6,16,FALSE)))","v":""},null,null,null,null,null,null,null,{"$f":"IF(B845=\"\",0,IF(B845=B844,COUNTIF(B$9:B844,B845)+1,1))","v":833},0,0]
["838","-1900","-1900-834",null,null,null,null,null,null,null,null,null,null,null,null,null,null,null,null,null,null,{"$f":"IF(M$1019=1,\"\",IF(U846=\"\",\"\",VLOOKUP(U846,Tabelle!$B$4:$O$6,14,FALSE)))","v":""},{"$f":"IF(M$1019=1,\"\",IF(U846=\"\",\"\",VLOOKUP(U846,Tabelle!$B$4:$Q$6,16,FALSE)))","v":""},null,null,null,null,null,null,null,{"$f":"IF(B846=\"\",0,IF(B846=B845,COUNTIF(B$9:B845,B846)+1,1))","v":834},0,0]
["839","-1900","-1900-835",null,null,null,null,null,null,null,null,null,null,null,null,null,null,null,null,null,null,{"$f":"IF(M$1019=1,\"\",IF(U847=\"\",\"\",VLOOKUP(U847,Tabelle!$B$4:$O$6,14,FALSE)))","v":""},{"$f":"IF(M$1019=1,\"\",IF(U847=\"\",\"\",VLOOKUP(U847,Tabelle!$B$4:$Q$6,16,FALSE)))","v":""},null,null,null,null,null,null,null,{"$f":"IF(B847=\"\",0,IF(B847=B846,COUNTIF(B$9:B846,B847)+1,1))","v":835},0,0]
["840","-1900","-1900-836",null,null,null,null,null,null,null,null,null,null,null,null,null,null,null,null,null,null,{"$f":"IF(M$1019=1,\"\",IF(U848=\"\",\"\",VLOOKUP(U848,Tabelle!$B$4:$O$6,14,FALSE)))","v":""},{"$f":"IF(M$1019=1,\"\",IF(U848=\"\",\"\",VLOOKUP(U848,Tabelle!$B$4:$Q$6,16,FALSE)))","v":""},null,null,null,null,null,null,null,{"$f":"IF(B848=\"\",0,IF(B848=B847,COUNTIF(B$9:B847,B848)+1,1))","v":836},0,0]
["841","-1900","-1900-837",null,null,null,null,null,null,null,null,null,null,null,null,null,null,null,null,null,null,{"$f":"IF(M$1019=1,\"\",IF(U849=\"\",\"\",VLOOKUP(U849,Tabelle!$B$4:$O$6,14,FALSE)))","v":""},{"$f":"IF(M$1019=1,\"\",IF(U849=\"\",\"\",VLOOKUP(U849,Tabelle!$B$4:$Q$6,16,FALSE)))","v":""},null,null,null,null,null,null,null,{"$f":"IF(B849=\"\",0,IF(B849=B848,COUNTIF(B$9:B848,B849)+1,1))","v":837},0,0]
["842","-1900","-1900-838",null,null,null,null,null,null,null,null,null,null,null,null,null,null,null,null,null,null,{"$f":"IF(M$1019=1,\"\",IF(U850=\"\",\"\",VLOOKUP(U850,Tabelle!$B$4:$O$6,14,FALSE)))","v":""},{"$f":"IF(M$1019=1,\"\",IF(U850=\"\",\"\",VLOOKUP(U850,Tabelle!$B$4:$Q$6,16,FALSE)))","v":""},null,null,null,null,null,null,null,{"$f":"IF(B850=\"\",0,IF(B850=B849,COUNTIF(B$9:B849,B850)+1,1))","v":838},0,0]
["843","-1900","-1900-839",null,null,null,null,null,null,null,null,null,null,null,null,null,null,null,null,null,null,{"$f":"IF(M$1019=1,\"\",IF(U851=\"\",\"\",VLOOKUP(U851,Tabelle!$B$4:$O$6,14,FALSE)))","v":""},{"$f":"IF(M$1019=1,\"\",IF(U851=\"\",\"\",VLOOKUP(U851,Tabelle!$B$4:$Q$6,16,FALSE)))","v":""},null,null,null,null,null,null,null,{"$f":"IF(B851=\"\",0,IF(B851=B850,COUNTIF(B$9:B850,B851)+1,1))","v":839},0,0]
["844","-1900","-1900-840",null,null,null,null,null,null,null,null,null,null,null,null,null,null,null,null,null,null,{"$f":"IF(M$1019=1,\"\",IF(U852=\"\",\"\",VLOOKUP(U852,Tabelle!$B$4:$O$6,14,FALSE)))","v":""},{"$f":"IF(M$1019=1,\"\",IF(U852=\"\",\"\",VLOOKUP(U852,Tabelle!$B$4:$Q$6,16,FALSE)))","v":""},null,null,null,null,null,null,null,{"$f":"IF(B852=\"\",0,IF(B852=B851,COUNTIF(B$9:B851,B852)+1,1))","v":840},{"$f":"IF(OR(D852=\"\",M$1019=1),0,IF(AE852=8,1,0))","v":0},0]
["845","-1900","-1900-841",null,null,null,null,null,null,null,null,null,null,null,null,null,null,null,null,null,null,{"$f":"IF(M$1019=1,\"\",IF(U853=\"\",\"\",VLOOKUP(U853,Tabelle!$B$4:$O$6,14,FALSE)))","v":""},{"$f":"IF(M$1019=1,\"\",IF(U853=\"\",\"\",VLOOKUP(U853,Tabelle!$B$4:$Q$6,16,FALSE)))","v":""},null,null,null,null,null,null,null,{"$f":"IF(B853=\"\",0,IF(B853=B852,COUNTIF(B$9:B852,B853)+1,1))","v":841},0,0]
["846","-1900","-1900-842",null,null,null,null,null,null,null,null,null,null,null,null,null,null,null,null,null,null,{"$f":"IF(M$1019=1,\"\",IF(U854=\"\",\"\",VLOOKUP(U854,Tabelle!$B$4:$O$6,14,FALSE)))","v":""},{"$f":"IF(M$1019=1,\"\",IF(U854=\"\",\"\",VLOOKUP(U854,Tabelle!$B$4:$Q$6,16,FALSE)))","v":""},null,null,null,null,null,null,null,{"$f":"IF(B854=\"\",0,IF(B854=B853,COUNTIF(B$9:B853,B854)+1,1))","v":842},0,0]
["847","-1900","-1900-843",null,null,null,null,null,null,null,null,null,null,null,null,null,null,null,null,null,null,{"$f":"IF(M$1019=1,\"\",IF(U855=\"\",\"\",VLOOKUP(U855,Tabelle!$B$4:$O$6,14,FALSE)))","v":""},{"$f":"IF(M$1019=1,\"\",IF(U855=\"\",\"\",VLOOKUP(U855,Tabelle!$B$4:$Q$6,16,FALSE)))","v":""},null,null,null,null,null,null,null,{"$f":"IF(B855=\"\",0,IF(B855=B854,COUNTIF(B$9:B854,B855)+1,1))","v":843},0,0]
["848","-1900","-1900-844",null,null,null,null,null,null,null,null,null,null,null,null,null,null,null,null,null,null,{"$f":"IF(M$1019=1,\"\",IF(U856=\"\",\"\",VLOOKUP(U856,Tabelle!$B$4:$O$6,14,FALSE)))","v":""},{"$f":"IF(M$1019=1,\"\",IF(U856=\"\",\"\",VLOOKUP(U856,Tabelle!$B$4:$Q$6,16,FALSE)))","v":""},null,null,null,null,null,null,null,{"$f":"IF(B856=\"\",0,IF(B856=B855,COUNTIF(B$9:B855,B856)+1,1))","v":844},0,0]
["849","-1900","-1900-845",null,null,null,null,null,null,null,null,null,null,null,null,null,null,null,null,null,null,{"$f":"IF(M$1019=1,\"\",IF(U857=\"\",\"\",VLOOKUP(U857,Tabelle!$B$4:$O$6,14,FALSE)))","v":""},{"$f":"IF(M$1019=1,\"\",IF(U857=\"\",\"\",VLOOKUP(U857,Tabelle!$B$4:$Q$6,16,FALSE)))","v":""},null,null,null,null,null,null,null,{"$f":"IF(B857=\"\",0,IF(B857=B856,COUNTIF(B$9:B856,B857)+1,1))","v":845},0,0]
["850","-1900","-1900-846",null,null,null,null,null,null,null,null,null,null,null,null,null,null,null,null,null,null,{"$f":"IF(M$1019=1,\"\",IF(U858=\"\",\"\",VLOOKUP(U858,Tabelle!$B$4:$O$6,14,FALSE)))","v":""},{"$f":"IF(M$1019=1,\"\",IF(U858=\"\",\"\",VLOOKUP(U858,Tabelle!$B$4:$Q$6,16,FALSE)))","v":""},null,null,null,null,null,null,null,{"$f":"IF(B858=\"\",0,IF(B858=B857,COUNTIF(B$9:B857,B858)+1,1))","v":846},0,0]
["851","-1900","-1900-847",null,null,null,null,null,null,null,null,null,null,null,null,null,null,null,null,null,null,{"$f":"IF(M$1019=1,\"\",IF(U859=\"\",\"\",VLOOKUP(U859,Tabelle!$B$4:$O$6,14,FALSE)))","v":""},{"$f":"IF(M$1019=1,\"\",IF(U859=\"\",\"\",VLOOKUP(U859,Tabelle!$B$4:$Q$6,16,FALSE)))","v":""},null,null,null,null,null,null,null,{"$f":"IF(B859=\"\",0,IF(B859=B858,COUNTIF(B$9:B858,B859)+1,1))","v":847},0,0]
["852","-1900","-1900-848",null,null,null,null,null,null,null,null,null,null,null,null,null,null,null,null,null,null,{"$f":"IF(M$1019=1,\"\",IF(U860=\"\",\"\",VLOOKUP(U860,Tabelle!$B$4:$O$6,14,FALSE)))","v":""},{"$f":"IF(M$1019=1,\"\",IF(U860=\"\",\"\",VLOOKUP(U860,Tabelle!$B$4:$Q$6,16,FALSE)))","v":""},null,null,null,null,null,null,null,{"$f":"IF(B860=\"\",0,IF(B860=B859,COUNTIF(B$9:B859,B860)+1,1))","v":848},0,0]
["853","-1900","-1900-849",null,null,null,null,null,null,null,null,null,null,null,null,null,null,null,null,null,null,{"$f":"IF(M$1019=1,\"\",IF(U861=\"\",\"\",VLOOKUP(U861,Tabelle!$B$4:$O$6,14,FALSE)))","v":""},{"$f":"IF(M$1019=1,\"\",IF(U861=\"\",\"\",VLOOKUP(U861,Tabelle!$B$4:$Q$6,16,FALSE)))","v":""},null,null,null,null,null,null,null,{"$f":"IF(B861=\"\",0,IF(B861=B860,COUNTIF(B$9:B860,B861)+1,1))","v":849},0,0]
["854","-1900","-1900-850",null,null,null,null,null,null,null,null,null,null,null,null,null,null,null,null,null,null,{"$f":"IF(M$1019=1,\"\",IF(U862=\"\",\"\",VLOOKUP(U862,Tabelle!$B$4:$O$6,14,FALSE)))","v":""},{"$f":"IF(M$1019=1,\"\",IF(U862=\"\",\"\",VLOOKUP(U862,Tabelle!$B$4:$Q$6,16,FALSE)))","v":""},null,null,null,null,null,null,null,{"$f":"IF(B862=\"\",0,IF(B862=B861,COUNTIF(B$9:B861,B862)+1,1))","v":850},0,0]
["855","-1900","-1900-851",null,null,null,null,null,null,null,null,null,null,null,null,null,null,null,null,null,null,{"$f":"IF(M$1019=1,\"\",IF(U863=\"\",\"\",VLOOKUP(U863,Tabelle!$B$4:$O$6,14,FALSE)))","v":""},{"$f":"IF(M$1019=1,\"\",IF(U863=\"\",\"\",VLOOKUP(U863,Tabelle!$B$4:$Q$6,16,FALSE)))","v":""},null,null,null,null,null,null,null,{"$f":"IF(B863=\"\",0,IF(B863=B862,COUNTIF(B$9:B862,B863)+1,1))","v":851},0,0]
["856","-1900","-1900-852",null,null,null,null,null,null,null,null,null,null,null,null,null,null,null,null,null,null,{"$f":"IF(M$1019=1,\"\",IF(U864=\"\",\"\",VLOOKUP(U864,Tabelle!$B$4:$O$6,14,FALSE)))","v":""},{"$f":"IF(M$1019=1,\"\",IF(U864=\"\",\"\",VLOOKUP(U864,Tabelle!$B$4:$Q$6,16,FALSE)))","v":""},null,null,null,null,null,null,null,{"$f":"IF(B864=\"\",0,IF(B864=B863,COUNTIF(B$9:B863,B864)+1,1))","v":852},0,0]
["857","-1900","-1900-853",null,null,null,null,null,null,null,null,null,null,null,null,null,null,null,null,null,null,{"$f":"IF(M$1019=1,\"\",IF(U865=\"\",\"\",VLOOKUP(U865,Tabelle!$B$4:$O$6,14,FALSE)))","v":""},{"$f":"IF(M$1019=1,\"\",IF(U865=\"\",\"\",VLOOKUP(U865,Tabelle!$B$4:$Q$6,16,FALSE)))","v":""},null,null,null,null,null,null,null,{"$f":"IF(B865=\"\",0,IF(B865=B864,COUNTIF(B$9:B864,B865)+1,1))","v":853},0,0]
["858","-1900","-1900-854",null,null,null,null,null,null,null,null,null,null,null,null,null,null,null,null,null,null,{"$f":"IF(M$1019=1,\"\",IF(U866=\"\",\"\",VLOOKUP(U866,Tabelle!$B$4:$O$6,14,FALSE)))","v":""},{"$f":"IF(M$1019=1,\"\",IF(U866=\"\",\"\",VLOOKUP(U866,Tabelle!$B$4:$Q$6,16,FALSE)))","v":""},null,null,null,null,null,null,null,{"$f":"IF(B866=\"\",0,IF(B866=B865,COUNTIF(B$9:B865,B866)+1,1))","v":854},0,0]
["859","-1900","-1900-855",null,null,null,null,null,null,null,null,null,null,null,null,null,null,null,null,null,null,{"$f":"IF(M$1019=1,\"\",IF(U867=\"\",\"\",VLOOKUP(U867,Tabelle!$B$4:$O$6,14,FALSE)))","v":""},{"$f":"IF(M$1019=1,\"\",IF(U867=\"\",\"\",VLOOKUP(U867,Tabelle!$B$4:$Q$6,16,FALSE)))","v":""},null,null,null,null,null,null,null,{"$f":"IF(B867=\"\",0,IF(B867=B866,COUNTIF(B$9:B866,B867)+1,1))","v":855},0,0]
["860","-1900","-1900-856",null,null,null,null,null,null,null,null,null,null,null,null,null,null,null,null,null,null,{"$f":"IF(M$1019=1,\"\",IF(U868=\"\",\"\",VLOOKUP(U868,Tabelle!$B$4:$O$6,14,FALSE)))","v":""},{"$f":"IF(M$1019=1,\"\",IF(U868=\"\",\"\",VLOOKUP(U868,Tabelle!$B$4:$Q$6,16,FALSE)))","v":""},null,null,null,null,null,null,null,{"$f":"IF(B868=\"\",0,IF(B868=B867,COUNTIF(B$9:B867,B868)+1,1))","v":856},0,0]
["861","-1900","-1900-857",null,null,null,null,null,null,null,null,null,null,null,null,null,null,null,null,null,null,{"$f":"IF(M$1019=1,\"\",IF(U869=\"\",\"\",VLOOKUP(U869,Tabelle!$B$4:$O$6,14,FALSE)))","v":""},{"$f":"IF(M$1019=1,\"\",IF(U869=\"\",\"\",VLOOKUP(U869,Tabelle!$B$4:$Q$6,16,FALSE)))","v":""},null,null,null,null,null,null,null,{"$f":"IF(B869=\"\",0,IF(B869=B868,COUNTIF(B$9:B868,B869)+1,1))","v":857},0,0]
["862","-1900","-1900-858",null,null,null,null,null,null,null,null,null,null,null,null,null,null,null,null,null,null,{"$f":"IF(M$1019=1,\"\",IF(U870=\"\",\"\",VLOOKUP(U870,Tabelle!$B$4:$O$6,14,FALSE)))","v":""},{"$f":"IF(M$1019=1,\"\",IF(U870=\"\",\"\",VLOOKUP(U870,Tabelle!$B$4:$Q$6,16,FALSE)))","v":""},null,null,null,null,null,null,null,{"$f":"IF(B870=\"\",0,IF(B870=B869,COUNTIF(B$9:B869,B870)+1,1))","v":858},0,0]
["863","-1900","-1900-859",null,null,null,null,null,null,null,null,null,null,null,null,null,null,null,null,null,null,{"$f":"IF(M$1019=1,\"\",IF(U871=\"\",\"\",VLOOKUP(U871,Tabelle!$B$4:$O$6,14,FALSE)))","v":""},{"$f":"IF(M$1019=1,\"\",IF(U871=\"\",\"\",VLOOKUP(U871,Tabelle!$B$4:$Q$6,16,FALSE)))","v":""},null,null,null,null,null,null,null,{"$f":"IF(B871=\"\",0,IF(B871=B870,COUNTIF(B$9:B870,B871)+1,1))","v":859},0,0]
["864","-1900","-1900-860",null,null,null,null,null,null,null,null,null,null,null,null,null,null,null,null,null,null,{"$f":"IF(M$1019=1,\"\",IF(U872=\"\",\"\",VLOOKUP(U872,Tabelle!$B$4:$O$6,14,FALSE)))","v":""},{"$f":"IF(M$1019=1,\"\",IF(U872=\"\",\"\",VLOOKUP(U872,Tabelle!$B$4:$Q$6,16,FALSE)))","v":""},null,null,null,null,null,null,null,{"$f":"IF(B872=\"\",0,IF(B872=B871,COUNTIF(B$9:B871,B872)+1,1))","v":860},0,0]
["865","-1900","-1900-861",null,null,null,null,null,null,null,null,null,null,null,null,null,null,null,null,null,null,{"$f":"IF(M$1019=1,\"\",IF(U873=\"\",\"\",VLOOKUP(U873,Tabelle!$B$4:$O$6,14,FALSE)))","v":""},{"$f":"IF(M$1019=1,\"\",IF(U873=\"\",\"\",VLOOKUP(U873,Tabelle!$B$4:$Q$6,16,FALSE)))","v":""},null,null,null,null,null,null,null,{"$f":"IF(B873=\"\",0,IF(B873=B872,COUNTIF(B$9:B872,B873)+1,1))","v":861},0,0]
["866","-1900","-1900-862",null,null,null,null,null,null,null,null,null,null,null,null,null,null,null,null,null,null,{"$f":"IF(M$1019=1,\"\",IF(U874=\"\",\"\",VLOOKUP(U874,Tabelle!$B$4:$O$6,14,FALSE)))","v":""},{"$f":"IF(M$1019=1,\"\",IF(U874=\"\",\"\",VLOOKUP(U874,Tabelle!$B$4:$Q$6,16,FALSE)))","v":""},null,null,null,null,null,null,null,{"$f":"IF(B874=\"\",0,IF(B874=B873,COUNTIF(B$9:B873,B874)+1,1))","v":862},0,0]
["867","-1900","-1900-863",null,null,null,null,null,null,null,null,null,null,null,null,null,null,null,null,null,null,{"$f":"IF(M$1019=1,\"\",IF(U875=\"\",\"\",VLOOKUP(U875,Tabelle!$B$4:$O$6,14,FALSE)))","v":""},{"$f":"IF(M$1019=1,\"\",IF(U875=\"\",\"\",VLOOKUP(U875,Tabelle!$B$4:$Q$6,16,FALSE)))","v":""},null,null,null,null,null,null,null,{"$f":"IF(B875=\"\",0,IF(B875=B874,COUNTIF(B$9:B874,B875)+1,1))","v":863},0,0]
["868","-1900","-1900-864",null,null,null,null,null,null,null,null,null,null,null,null,null,null,null,null,null,null,{"$f":"IF(M$1019=1,\"\",IF(U876=\"\",\"\",VLOOKUP(U876,Tabelle!$B$4:$O$6,14,FALSE)))","v":""},{"$f":"IF(M$1019=1,\"\",IF(U876=\"\",\"\",VLOOKUP(U876,Tabelle!$B$4:$Q$6,16,FALSE)))","v":""},null,null,null,null,null,null,null,{"$f":"IF(B876=\"\",0,IF(B876=B875,COUNTIF(B$9:B875,B876)+1,1))","v":864},0,0]
["869","-1900","-1900-865",null,null,null,null,null,null,null,null,null,null,null,null,null,null,null,null,null,null,{"$f":"IF(M$1019=1,\"\",IF(U877=\"\",\"\",VLOOKUP(U877,Tabelle!$B$4:$O$6,14,FALSE)))","v":""},{"$f":"IF(M$1019=1,\"\",IF(U877=\"\",\"\",VLOOKUP(U877,Tabelle!$B$4:$Q$6,16,FALSE)))","v":""},null,null,null,null,null,null,null,{"$f":"IF(B877=\"\",0,IF(B877=B876,COUNTIF(B$9:B876,B877)+1,1))","v":865},0,0]
["870","-1900","-1900-866",null,null,null,null,null,null,null,null,null,null,null,null,null,null,null,null,null,null,{"$f":"IF(M$1019=1,\"\",IF(U878=\"\",\"\",VLOOKUP(U878,Tabelle!$B$4:$O$6,14,FALSE)))","v":""},{"$f":"IF(M$1019=1,\"\",IF(U878=\"\",\"\",VLOOKUP(U878,Tabelle!$B$4:$Q$6,16,FALSE)))","v":""},null,null,null,null,null,null,null,{"$f":"IF(B878=\"\",0,IF(B878=B877,COUNTIF(B$9:B877,B878)+1,1))","v":866},0,0]
["871","-1900","-1900-867",null,null,null,null,null,null,null,null,null,null,null,null,null,null,null,null,null,null,{"$f":"IF(M$1019=1,\"\",IF(U879=\"\",\"\",VLOOKUP(U879,Tabelle!$B$4:$O$6,14,FALSE)))","v":""},{"$f":"IF(M$1019=1,\"\",IF(U879=\"\",\"\",VLOOKUP(U879,Tabelle!$B$4:$Q$6,16,FALSE)))","v":""},null,null,null,null,null,null,null,{"$f":"IF(B879=\"\",0,IF(B879=B878,COUNTIF(B$9:B878,B879)+1,1))","v":867},0,0]
["872","-1900","-1900-868",null,null,null,null,null,null,null,null,null,null,null,null,null,null,null,null,null,null,{"$f":"IF(M$1019=1,\"\",IF(U880=\"\",\"\",VLOOKUP(U880,Tabelle!$B$4:$O$6,14,FALSE)))","v":""},{"$f":"IF(M$1019=1,\"\",IF(U880=\"\",\"\",VLOOKUP(U880,Tabelle!$B$4:$Q$6,16,FALSE)))","v":""},null,null,null,null,null,null,null,{"$f":"IF(B880=\"\",0,IF(B880=B879,COUNTIF(B$9:B879,B880)+1,1))","v":868},0,0]
["873","-1900","-1900-869",null,null,null,null,null,null,null,null,null,null,null,null,null,null,null,null,null,null,{"$f":"IF(M$1019=1,\"\",IF(U881=\"\",\"\",VLOOKUP(U881,Tabelle!$B$4:$O$6,14,FALSE)))","v":""},{"$f":"IF(M$1019=1,\"\",IF(U881=\"\",\"\",VLOOKUP(U881,Tabelle!$B$4:$Q$6,16,FALSE)))","v":""},null,null,null,null,null,null,null,{"$f":"IF(B881=\"\",0,IF(B881=B880,COUNTIF(B$9:B880,B881)+1,1))","v":869},0,0]
["874","-1900","-1900-870",null,null,null,null,null,null,null,null,null,null,null,null,null,null,null,null,null,null,{"$f":"IF(M$1019=1,\"\",IF(U882=\"\",\"\",VLOOKUP(U882,Tabelle!$B$4:$O$6,14,FALSE)))","v":""},{"$f":"IF(M$1019=1,\"\",IF(U882=\"\",\"\",VLOOKUP(U882,Tabelle!$B$4:$Q$6,16,FALSE)))","v":""},null,null,null,null,null,null,null,{"$f":"IF(B882=\"\",0,IF(B882=B881,COUNTIF(B$9:B881,B882)+1,1))","v":870},0,0]
["875","-1900",{"$f":"IF(M$1019=1,0,B883&\"-\"&AE883)","v":"-1900-871"},null,null,null,null,null,null,null,null,null,null,null,null,null,null,null,null,null,null,{"$f":"IF(M$1019=1,\"\",IF(U883=\"\",\"\",VLOOKUP(U883,Tabelle!$B$4:$O$6,14,FALSE)))","v":""},{"$f":"IF(M$1019=1,\"\",IF(U883=\"\",\"\",VLOOKUP(U883,Tabelle!$B$4:$Q$6,16,FALSE)))","v":""},null,null,null,null,null,null,null,{"$f":"IF(B883=\"\",0,IF(B883=B882,COUNTIF(B$9:B882,B883)+1,1))","v":871},0,0]
["876","-1900","-1900-872",null,null,null,null,null,null,null,null,null,null,null,null,null,null,null,null,null,null,{"$f":"IF(M$1019=1,\"\",IF(U884=\"\",\"\",VLOOKUP(U884,Tabelle!$B$4:$O$6,14,FALSE)))","v":""},{"$f":"IF(M$1019=1,\"\",IF(U884=\"\",\"\",VLOOKUP(U884,Tabelle!$B$4:$Q$6,16,FALSE)))","v":""},null,null,null,null,null,null,null,{"$f":"IF(B884=\"\",0,IF(B884=B883,COUNTIF(B$9:B883,B884)+1,1))","v":872},0,0]
["877","-1900","-1900-873",null,null,null,null,null,null,null,null,null,null,null,null,null,null,null,null,null,null,{"$f":"IF(M$1019=1,\"\",IF(U885=\"\",\"\",VLOOKUP(U885,Tabelle!$B$4:$O$6,14,FALSE)))","v":""},{"$f":"IF(M$1019=1,\"\",IF(U885=\"\",\"\",VLOOKUP(U885,Tabelle!$B$4:$Q$6,16,FALSE)))","v":""},null,null,null,null,null,null,null,{"$f":"IF(B885=\"\",0,IF(B885=B884,COUNTIF(B$9:B884,B885)+1,1))","v":873},0,0]
["878","-1900","-1900-874",null,null,null,null,null,null,null,null,null,null,null,null,null,null,null,null,null,null,{"$f":"IF(M$1019=1,\"\",IF(U886=\"\",\"\",VLOOKUP(U886,Tabelle!$B$4:$O$6,14,FALSE)))","v":""},{"$f":"IF(M$1019=1,\"\",IF(U886=\"\",\"\",VLOOKUP(U886,Tabelle!$B$4:$Q$6,16,FALSE)))","v":""},null,null,null,null,null,null,null,{"$f":"IF(B886=\"\",0,IF(B886=B885,COUNTIF(B$9:B885,B886)+1,1))","v":874},0,0]
["879","-1900","-1900-875",null,null,null,null,null,null,null,null,null,null,null,null,null,null,null,null,null,null,{"$f":"IF(M$1019=1,\"\",IF(U887=\"\",\"\",VLOOKUP(U887,Tabelle!$B$4:$O$6,14,FALSE)))","v":""},{"$f":"IF(M$1019=1,\"\",IF(U887=\"\",\"\",VLOOKUP(U887,Tabelle!$B$4:$Q$6,16,FALSE)))","v":""},null,null,null,null,null,null,null,{"$f":"IF(B887=\"\",0,IF(B887=B886,COUNTIF(B$9:B886,B887)+1,1))","v":875},0,0]
["880","-1900","-1900-876",null,null,null,null,null,null,null,null,null,null,null,null,null,null,null,null,null,null,{"$f":"IF(M$1019=1,\"\",IF(U888=\"\",\"\",VLOOKUP(U888,Tabelle!$B$4:$O$6,14,FALSE)))","v":""},{"$f":"IF(M$1019=1,\"\",IF(U888=\"\",\"\",VLOOKUP(U888,Tabelle!$B$4:$Q$6,16,FALSE)))","v":""},null,null,null,null,null,null,null,{"$f":"IF(B888=\"\",0,IF(B888=B887,COUNTIF(B$9:B887,B888)+1,1))","v":876},0,0]
["881","-1900","-1900-877",null,null,null,null,null,null,null,null,null,null,null,null,null,null,null,null,null,null,{"$f":"IF(M$1019=1,\"\",IF(U889=\"\",\"\",VLOOKUP(U889,Tabelle!$B$4:$O$6,14,FALSE)))","v":""},{"$f":"IF(M$1019=1,\"\",IF(U889=\"\",\"\",VLOOKUP(U889,Tabelle!$B$4:$Q$6,16,FALSE)))","v":""},null,null,null,null,null,null,null,{"$f":"IF(B889=\"\",0,IF(B889=B888,COUNTIF(B$9:B888,B889)+1,1))","v":877},0,0]
["882","-1900","-1900-878",null,null,null,null,null,null,null,null,null,null,null,null,null,null,null,null,null,null,{"$f":"IF(M$1019=1,\"\",IF(U890=\"\",\"\",VLOOKUP(U890,Tabelle!$B$4:$O$6,14,FALSE)))","v":""},{"$f":"IF(M$1019=1,\"\",IF(U890=\"\",\"\",VLOOKUP(U890,Tabelle!$B$4:$Q$6,16,FALSE)))","v":""},null,null,null,null,null,null,null,{"$f":"IF(B890=\"\",0,IF(B890=B889,COUNTIF(B$9:B889,B890)+1,1))","v":878},0,0]
["883","-1900","-1900-879",null,null,null,null,null,null,null,null,null,null,null,null,null,null,null,null,null,null,{"$f":"IF(M$1019=1,\"\",IF(U891=\"\",\"\",VLOOKUP(U891,Tabelle!$B$4:$O$6,14,FALSE)))","v":""},{"$f":"IF(M$1019=1,\"\",IF(U891=\"\",\"\",VLOOKUP(U891,Tabelle!$B$4:$Q$6,16,FALSE)))","v":""},null,null,null,null,null,null,null,{"$f":"IF(B891=\"\",0,IF(B891=B890,COUNTIF(B$9:B890,B891)+1,1))","v":879},0,0]
["884","-1900","-1900-880",null,null,null,null,null,null,null,null,null,null,null,null,null,null,null,null,null,null,{"$f":"IF(M$1019=1,\"\",IF(U892=\"\",\"\",VLOOKUP(U892,Tabelle!$B$4:$O$6,14,FALSE)))","v":""},{"$f":"IF(M$1019=1,\"\",IF(U892=\"\",\"\",VLOOKUP(U892,Tabelle!$B$4:$Q$6,16,FALSE)))","v":""},null,null,null,null,null,null,null,{"$f":"IF(B892=\"\",0,IF(B892=B891,COUNTIF(B$9:B891,B892)+1,1))","v":880},0,0]
["885","-1900","-1900-881",null,null,null,null,null,null,null,null,null,null,null,null,null,null,null,null,null,null,{"$f":"IF(M$1019=1,\"\",IF(U893=\"\",\"\",VLOOKUP(U893,Tabelle!$B$4:$O$6,14,FALSE)))","v":""},{"$f":"IF(M$1019=1,\"\",IF(U893=\"\",\"\",VLOOKUP(U893,Tabelle!$B$4:$Q$6,16,FALSE)))","v":""},null,null,null,null,null,null,null,{"$f":"IF(B893=\"\",0,IF(B893=B892,COUNTIF(B$9:B892,B893)+1,1))","v":881},0,0]
["886","-1900","-1900-882",null,null,null,null,null,null,null,null,null,null,null,null,null,null,null,null,null,null,{"$f":"IF(M$1019=1,\"\",IF(U894=\"\",\"\",VLOOKUP(U894,Tabelle!$B$4:$O$6,14,FALSE)))","v":""},{"$f":"IF(M$1019=1,\"\",IF(U894=\"\",\"\",VLOOKUP(U894,Tabelle!$B$4:$Q$6,16,FALSE)))","v":""},null,null,null,null,null,null,null,{"$f":"IF(B894=\"\",0,IF(B894=B893,COUNTIF(B$9:B893,B894)+1,1))","v":882},0,0]
["887","-1900","-1900-883",null,null,null,null,null,null,null,null,null,null,null,null,null,null,null,null,null,null,{"$f":"IF(M$1019=1,\"\",IF(U895=\"\",\"\",VLOOKUP(U895,Tabelle!$B$4:$O$6,14,FALSE)))","v":""},{"$f":"IF(M$1019=1,\"\",IF(U895=\"\",\"\",VLOOKUP(U895,Tabelle!$B$4:$Q$6,16,FALSE)))","v":""},null,null,null,null,null,null,null,{"$f":"IF(B895=\"\",0,IF(B895=B894,COUNTIF(B$9:B894,B895)+1,1))","v":883},0,0]
["888","-1900","-1900-884",null,null,null,null,null,null,null,null,null,null,null,null,null,null,null,null,null,null,{"$f":"IF(M$1019=1,\"\",IF(U896=\"\",\"\",VLOOKUP(U896,Tabelle!$B$4:$O$6,14,FALSE)))","v":""},{"$f":"IF(M$1019=1,\"\",IF(U896=\"\",\"\",VLOOKUP(U896,Tabelle!$B$4:$Q$6,16,FALSE)))","v":""},null,null,null,null,null,null,null,{"$f":"IF(B896=\"\",0,IF(B896=B895,COUNTIF(B$9:B895,B896)+1,1))","v":884},0,0]
["889","-1900","-1900-885",null,null,null,null,null,null,null,null,null,null,null,null,null,null,null,null,null,null,{"$f":"IF(M$1019=1,\"\",IF(U897=\"\",\"\",VLOOKUP(U897,Tabelle!$B$4:$O$6,14,FALSE)))","v":""},{"$f":"IF(M$1019=1,\"\",IF(U897=\"\",\"\",VLOOKUP(U897,Tabelle!$B$4:$Q$6,16,FALSE)))","v":""},null,null,null,null,null,null,null,{"$f":"IF(B897=\"\",0,IF(B897=B896,COUNTIF(B$9:B896,B897)+1,1))","v":885},0,0]
["890","-1900","-1900-886",null,null,null,null,null,null,null,null,null,null,null,null,null,null,null,null,null,null,{"$f":"IF(M$1019=1,\"\",IF(U898=\"\",\"\",VLOOKUP(U898,Tabelle!$B$4:$O$6,14,FALSE)))","v":""},{"$f":"IF(M$1019=1,\"\",IF(U898=\"\",\"\",VLOOKUP(U898,Tabelle!$B$4:$Q$6,16,FALSE)))","v":""},null,null,null,null,null,null,null,{"$f":"IF(B898=\"\",0,IF(B898=B897,COUNTIF(B$9:B897,B898)+1,1))","v":886},0,0]
["891","-1900","-1900-887",null,null,null,null,null,null,null,null,null,null,null,null,null,null,null,null,null,null,{"$f":"IF(M$1019=1,\"\",IF(U899=\"\",\"\",VLOOKUP(U899,Tabelle!$B$4:$O$6,14,FALSE)))","v":""},{"$f":"IF(M$1019=1,\"\",IF(U899=\"\",\"\",VLOOKUP(U899,Tabelle!$B$4:$Q$6,16,FALSE)))","v":""},null,null,null,null,null,null,null,{"$f":"IF(B899=\"\",0,IF(B899=B898,COUNTIF(B$9:B898,B899)+1,1))","v":887},0,0]
["892","-1900","-1900-888",null,null,null,null,null,null,null,null,null,null,null,null,null,null,null,null,null,null,{"$f":"IF(M$1019=1,\"\",IF(U900=\"\",\"\",VLOOKUP(U900,Tabelle!$B$4:$O$6,14,FALSE)))","v":""},{"$f":"IF(M$1019=1,\"\",IF(U900=\"\",\"\",VLOOKUP(U900,Tabelle!$B$4:$Q$6,16,FALSE)))","v":""},null,null,null,null,null,null,null,{"$f":"IF(B900=\"\",0,IF(B900=B899,COUNTIF(B$9:B899,B900)+1,1))","v":888},0,0]
["893","-1900","-1900-889",null,null,null,null,null,null,null,null,null,null,null,null,null,null,null,null,null,null,{"$f":"IF(M$1019=1,\"\",IF(U901=\"\",\"\",VLOOKUP(U901,Tabelle!$B$4:$O$6,14,FALSE)))","v":""},{"$f":"IF(M$1019=1,\"\",IF(U901=\"\",\"\",VLOOKUP(U901,Tabelle!$B$4:$Q$6,16,FALSE)))","v":""},null,null,null,null,null,null,null,{"$f":"IF(B901=\"\",0,IF(B901=B900,COUNTIF(B$9:B900,B901)+1,1))","v":889},0,0]
["894","-1900","-1900-890",null,null,null,null,null,null,null,null,null,null,null,null,null,null,null,null,null,null,{"$f":"IF(M$1019=1,\"\",IF(U902=\"\",\"\",VLOOKUP(U902,Tabelle!$B$4:$O$6,14,FALSE)))","v":""},{"$f":"IF(M$1019=1,\"\",IF(U902=\"\",\"\",VLOOKUP(U902,Tabelle!$B$4:$Q$6,16,FALSE)))","v":""},null,null,null,null,null,null,null,{"$f":"IF(B902=\"\",0,IF(B902=B901,COUNTIF(B$9:B901,B902)+1,1))","v":890},0,0]
["895","-1900","-1900-891",null,null,null,null,null,null,null,null,null,null,null,null,null,null,null,null,null,null,{"$f":"IF(M$1019=1,\"\",IF(U903=\"\",\"\",VLOOKUP(U903,Tabelle!$B$4:$O$6,14,FALSE)))","v":""},{"$f":"IF(M$1019=1,\"\",IF(U903=\"\",\"\",VLOOKUP(U903,Tabelle!$B$4:$Q$6,16,FALSE)))","v":""},null,null,null,null,null,null,null,{"$f":"IF(B903=\"\",0,IF(B903=B902,COUNTIF(B$9:B902,B903)+1,1))","v":891},0,0]
["896","-1900","-1900-892",null,null,null,null,null,null,null,null,null,null,null,null,null,null,null,null,null,null,{"$f":"IF(M$1019=1,\"\",IF(U904=\"\",\"\",VLOOKUP(U904,Tabelle!$B$4:$O$6,14,FALSE)))","v":""},{"$f":"IF(M$1019=1,\"\",IF(U904=\"\",\"\",VLOOKUP(U904,Tabelle!$B$4:$Q$6,16,FALSE)))","v":""},null,null,null,null,null,null,null,{"$f":"IF(B904=\"\",0,IF(B904=B903,COUNTIF(B$9:B903,B904)+1,1))","v":892},0,0]
["897","-1900","-1900-893",null,null,null,null,null,null,null,null,null,null,null,null,null,null,null,null,null,null,{"$f":"IF(M$1019=1,\"\",IF(U905=\"\",\"\",VLOOKUP(U905,Tabelle!$B$4:$O$6,14,FALSE)))","v":""},{"$f":"IF(M$1019=1,\"\",IF(U905=\"\",\"\",VLOOKUP(U905,Tabelle!$B$4:$Q$6,16,FALSE)))","v":""},null,null,null,null,null,null,null,{"$f":"IF(B905=\"\",0,IF(B905=B904,COUNTIF(B$9:B904,B905)+1,1))","v":893},0,0]
["898",{"$f":"IF(AG906=$AG$1013,0,IF(M$1019=1,0,D906&\"-\"&YEAR(E906)))","v":"-1900"},"-1900-894",null,null,null,null,null,null,null,null,null,null,null,null,null,null,null,null,null,null,{"$f":"IF(M$1019=1,\"\",IF(U906=\"\",\"\",VLOOKUP(U906,Tabelle!$B$4:$O$6,14,FALSE)))","v":""},{"$f":"IF(M$1019=1,\"\",IF(U906=\"\",\"\",VLOOKUP(U906,Tabelle!$B$4:$Q$6,16,FALSE)))","v":""},null,null,null,null,null,null,null,{"$f":"IF(B906=\"\",0,IF(B906=B905,COUNTIF(B$9:B905,B906)+1,1))","v":894},0,{"$f":"IF(E906>0,IF(OR(MONTH(E906)<$L$1030,MONTH(E906)>$L$1031),AG$1013,0),0)","v":0}]
["899","-1900","-1900-895",null,null,null,null,null,null,null,null,null,null,null,null,null,null,null,null,null,null,{"$f":"IF(M$1019=1,\"\",IF(U907=\"\",\"\",VLOOKUP(U907,Tabelle!$B$4:$O$6,14,FALSE)))","v":""},{"$f":"IF(M$1019=1,\"\",IF(U907=\"\",\"\",VLOOKUP(U907,Tabelle!$B$4:$Q$6,16,FALSE)))","v":""},null,null,null,null,null,null,null,{"$f":"IF(B907=\"\",0,IF(B907=B906,COUNTIF(B$9:B906,B907)+1,1))","v":895},0,0]
["900 di 1000","-1900","-1900-896",null,null,null,null,null,null,null,null,null,null,null,null,null,null,null,null,null,null,{"$f":"IF(M$1019=1,\"\",IF(U908=\"\",\"\",VLOOKUP(U908,Tabelle!$B$4:$O$6,14,FALSE)))","v":""},{"$f":"IF(M$1019=1,\"\",IF(U908=\"\",\"\",VLOOKUP(U908,Tabelle!$B$4:$Q$6,16,FALSE)))","v":""},null,null,null,null,null,null,null,{"$f":"IF(B908=\"\",0,IF(B908=B907,COUNTIF(B$9:B907,B908)+1,1))","v":896},0,0]
["901","-1900","-1900-897",null,null,null,null,null,null,null,null,null,null,null,null,null,null,null,null,null,null,{"$f":"IF(M$1019=1,\"\",IF(U909=\"\",\"\",VLOOKUP(U909,Tabelle!$B$4:$O$6,14,FALSE)))","v":""},{"$f":"IF(M$1019=1,\"\",IF(U909=\"\",\"\",VLOOKUP(U909,Tabelle!$B$4:$Q$6,16,FALSE)))","v":""},null,null,null,null,null,null,null,{"$f":"IF(B909=\"\",0,IF(B909=B908,COUNTIF(B$9:B908,B909)+1,1))","v":897},0,0]
["902","-1900","-1900-898",null,null,null,null,null,null,null,null,null,null,null,null,null,null,null,null,null,null,{"$f":"IF(M$1019=1,\"\",IF(U910=\"\",\"\",VLOOKUP(U910,Tabelle!$B$4:$O$6,14,FALSE)))","v":""},{"$f":"IF(M$1019=1,\"\",IF(U910=\"\",\"\",VLOOKUP(U910,Tabelle!$B$4:$Q$6,16,FALSE)))","v":""},null,null,null,null,null,null,null,{"$f":"IF(B910=\"\",0,IF(B910=B909,COUNTIF(B$9:B909,B910)+1,1))","v":898},0,0]
["903","-1900","-1900-899",null,null,null,null,null,null,null,null,null,null,null,null,null,null,null,null,null,null,{"$f":"IF(M$1019=1,\"\",IF(U911=\"\",\"\",VLOOKUP(U911,Tabelle!$B$4:$O$6,14,FALSE)))","v":""},{"$f":"IF(M$1019=1,\"\",IF(U911=\"\",\"\",VLOOKUP(U911,Tabelle!$B$4:$Q$6,16,FALSE)))","v":""},null,null,null,null,null,null,null,{"$f":"IF(B911=\"\",0,IF(B911=B910,COUNTIF(B$9:B910,B911)+1,1))","v":899},0,0]
["904","-1900","-1900-900",null,null,null,null,null,null,null,null,null,null,null,null,null,null,null,null,null,null,{"$f":"IF(M$1019=1,\"\",IF(U912=\"\",\"\",VLOOKUP(U912,Tabelle!$B$4:$O$6,14,FALSE)))","v":""},{"$f":"IF(M$1019=1,\"\",IF(U912=\"\",\"\",VLOOKUP(U912,Tabelle!$B$4:$Q$6,16,FALSE)))","v":""},null,null,null,null,null,null,null,{"$f":"IF(B912=\"\",0,IF(B912=B911,COUNTIF(B$9:B911,B912)+1,1))","v":900},0,0]
["905","-1900","-1900-901",null,null,null,null,null,null,null,null,null,null,null,null,null,null,null,null,null,null,{"$f":"IF(M$1019=1,\"\",IF(U913=\"\",\"\",VLOOKUP(U913,Tabelle!$B$4:$O$6,14,FALSE)))","v":""},{"$f":"IF(M$1019=1,\"\",IF(U913=\"\",\"\",VLOOKUP(U913,Tabelle!$B$4:$Q$6,16,FALSE)))","v":""},null,null,null,null,null,null,null,{"$f":"IF(B913=\"\",0,IF(B913=B912,COUNTIF(B$9:B912,B913)+1,1))","v":901},0,0]
["906","-1900","-1900-902",null,null,null,null,null,null,null,null,null,null,null,null,null,null,null,null,null,null,{"$f":"IF(M$1019=1,\"\",IF(U914=\"\",\"\",VLOOKUP(U914,Tabelle!$B$4:$O$6,14,FALSE)))","v":""},{"$f":"IF(M$1019=1,\"\",IF(U914=\"\",\"\",VLOOKUP(U914,Tabelle!$B$4:$Q$6,16,FALSE)))","v":""},null,null,null,null,null,null,null,{"$f":"IF(B914=\"\",0,IF(B914=B913,COUNTIF(B$9:B913,B914)+1,1))","v":902},0,0]
["907","-1900","-1900-903",null,null,null,null,null,null,null,null,null,null,null,null,null,null,null,null,null,null,{"$f":"IF(M$1019=1,\"\",IF(U915=\"\",\"\",VLOOKUP(U915,Tabelle!$B$4:$O$6,14,FALSE)))","v":""},{"$f":"IF(M$1019=1,\"\",IF(U915=\"\",\"\",VLOOKUP(U915,Tabelle!$B$4:$Q$6,16,FALSE)))","v":""},null,null,null,null,null,null,null,{"$f":"IF(B915=\"\",0,IF(B915=B914,COUNTIF(B$9:B914,B915)+1,1))","v":903},0,0]
["908","-1900","-1900-904",null,null,null,null,null,null,null,null,null,null,null,null,null,null,null,null,null,null,{"$f":"IF(M$1019=1,\"\",IF(U916=\"\",\"\",VLOOKUP(U916,Tabelle!$B$4:$O$6,14,FALSE)))","v":""},{"$f":"IF(M$1019=1,\"\",IF(U916=\"\",\"\",VLOOKUP(U916,Tabelle!$B$4:$Q$6,16,FALSE)))","v":""},null,null,null,null,null,null,null,{"$f":"IF(B916=\"\",0,IF(B916=B915,COUNTIF(B$9:B915,B916)+1,1))","v":904},{"$f":"IF(OR(D916=\"\",M$1019=1),0,IF(AE916=8,1,0))","v":0},0]
["909","-1900","-1900-905",null,null,null,null,null,null,null,null,null,null,null,null,null,null,null,null,null,null,{"$f":"IF(M$1019=1,\"\",IF(U917=\"\",\"\",VLOOKUP(U917,Tabelle!$B$4:$O$6,14,FALSE)))","v":""},{"$f":"IF(M$1019=1,\"\",IF(U917=\"\",\"\",VLOOKUP(U917,Tabelle!$B$4:$Q$6,16,FALSE)))","v":""},null,null,null,null,null,null,null,{"$f":"IF(B917=\"\",0,IF(B917=B916,COUNTIF(B$9:B916,B917)+1,1))","v":905},0,0]
["910","-1900","-1900-906",null,null,null,null,null,null,null,null,null,null,null,null,null,null,null,null,null,null,{"$f":"IF(M$1019=1,\"\",IF(U918=\"\",\"\",VLOOKUP(U918,Tabelle!$B$4:$O$6,14,FALSE)))","v":""},{"$f":"IF(M$1019=1,\"\",IF(U918=\"\",\"\",VLOOKUP(U918,Tabelle!$B$4:$Q$6,16,FALSE)))","v":""},null,null,null,null,null,null,null,{"$f":"IF(B918=\"\",0,IF(B918=B917,COUNTIF(B$9:B917,B918)+1,1))","v":906},0,0]
["911","-1900","-1900-907",null,null,null,null,null,null,null,null,null,null,null,null,null,null,null,null,null,null,{"$f":"IF(M$1019=1,\"\",IF(U919=\"\",\"\",VLOOKUP(U919,Tabelle!$B$4:$O$6,14,FALSE)))","v":""},{"$f":"IF(M$1019=1,\"\",IF(U919=\"\",\"\",VLOOKUP(U919,Tabelle!$B$4:$Q$6,16,FALSE)))","v":""},null,null,null,null,null,null,null,{"$f":"IF(B919=\"\",0,IF(B919=B918,COUNTIF(B$9:B918,B919)+1,1))","v":907},0,0]
["912","-1900","-1900-908",null,null,null,null,null,null,null,null,null,null,null,null,null,null,null,null,null,null,{"$f":"IF(M$1019=1,\"\",IF(U920=\"\",\"\",VLOOKUP(U920,Tabelle!$B$4:$O$6,14,FALSE)))","v":""},{"$f":"IF(M$1019=1,\"\",IF(U920=\"\",\"\",VLOOKUP(U920,Tabelle!$B$4:$Q$6,16,FALSE)))","v":""},null,null,null,null,null,null,null,{"$f":"IF(B920=\"\",0,IF(B920=B919,COUNTIF(B$9:B919,B920)+1,1))","v":908},0,0]
["913","-1900","-1900-909",null,null,null,null,null,null,null,null,null,null,null,null,null,null,null,null,null,null,{"$f":"IF(M$1019=1,\"\",IF(U921=\"\",\"\",VLOOKUP(U921,Tabelle!$B$4:$O$6,14,FALSE)))","v":""},{"$f":"IF(M$1019=1,\"\",IF(U921=\"\",\"\",VLOOKUP(U921,Tabelle!$B$4:$Q$6,16,FALSE)))","v":""},null,null,null,null,null,null,null,{"$f":"IF(B921=\"\",0,IF(B921=B920,COUNTIF(B$9:B920,B921)+1,1))","v":909},0,0]
["914","-1900","-1900-910",null,null,null,null,null,null,null,null,null,null,null,null,null,null,null,null,null,null,{"$f":"IF(M$1019=1,\"\",IF(U922=\"\",\"\",VLOOKUP(U922,Tabelle!$B$4:$O$6,14,FALSE)))","v":""},{"$f":"IF(M$1019=1,\"\",IF(U922=\"\",\"\",VLOOKUP(U922,Tabelle!$B$4:$Q$6,16,FALSE)))","v":""},null,null,null,null,null,null,null,{"$f":"IF(B922=\"\",0,IF(B922=B921,COUNTIF(B$9:B921,B922)+1,1))","v":910},0,0]
["915","-1900","-1900-911",null,null,null,null,null,null,null,null,null,null,null,null,null,null,null,null,null,null,{"$f":"IF(M$1019=1,\"\",IF(U923=\"\",\"\",VLOOKUP(U923,Tabelle!$B$4:$O$6,14,FALSE)))","v":""},{"$f":"IF(M$1019=1,\"\",IF(U923=\"\",\"\",VLOOKUP(U923,Tabelle!$B$4:$Q$6,16,FALSE)))","v":""},null,null,null,null,null,null,null,{"$f":"IF(B923=\"\",0,IF(B923=B922,COUNTIF(B$9:B922,B923)+1,1))","v":911},0,0]
["916","-1900","-1900-912",null,null,null,null,null,null,null,null,null,null,null,null,null,null,null,null,null,null,{"$f":"IF(M$1019=1,\"\",IF(U924=\"\",\"\",VLOOKUP(U924,Tabelle!$B$4:$O$6,14,FALSE)))","v":""},{"$f":"IF(M$1019=1,\"\",IF(U924=\"\",\"\",VLOOKUP(U924,Tabelle!$B$4:$Q$6,16,FALSE)))","v":""},null,null,null,null,null,null,null,{"$f":"IF(B924=\"\",0,IF(B924=B923,COUNTIF(B$9:B923,B924)+1,1))","v":912},0,0]
["917","-1900","-1900-913",null,null,null,null,null,null,null,null,null,null,null,null,null,null,null,null,null,null,{"$f":"IF(M$1019=1,\"\",IF(U925=\"\",\"\",VLOOKUP(U925,Tabelle!$B$4:$O$6,14,FALSE)))","v":""},{"$f":"IF(M$1019=1,\"\",IF(U925=\"\",\"\",VLOOKUP(U925,Tabelle!$B$4:$Q$6,16,FALSE)))","v":""},null,null,null,null,null,null,null,{"$f":"IF(B925=\"\",0,IF(B925=B924,COUNTIF(B$9:B924,B925)+1,1))","v":913},0,0]
["918","-1900","-1900-914",null,null,null,null,null,null,null,null,null,null,null,null,null,null,null,null,null,null,{"$f":"IF(M$1019=1,\"\",IF(U926=\"\",\"\",VLOOKUP(U926,Tabelle!$B$4:$O$6,14,FALSE)))","v":""},{"$f":"IF(M$1019=1,\"\",IF(U926=\"\",\"\",VLOOKUP(U926,Tabelle!$B$4:$Q$6,16,FALSE)))","v":""},null,null,null,null,null,null,null,{"$f":"IF(B926=\"\",0,IF(B926=B925,COUNTIF(B$9:B925,B926)+1,1))","v":914},0,0]
["919","-1900","-1900-915",null,null,null,null,null,null,null,null,null,null,null,null,null,null,null,null,null,null,{"$f":"IF(M$1019=1,\"\",IF(U927=\"\",\"\",VLOOKUP(U927,Tabelle!$B$4:$O$6,14,FALSE)))","v":""},{"$f":"IF(M$1019=1,\"\",IF(U927=\"\",\"\",VLOOKUP(U927,Tabelle!$B$4:$Q$6,16,FALSE)))","v":""},null,null,null,null,null,null,null,{"$f":"IF(B927=\"\",0,IF(B927=B926,COUNTIF(B$9:B926,B927)+1,1))","v":915},0,0]
["920","-1900","-1900-916",null,null,null,null,null,null,null,null,null,null,null,null,null,null,null,null,null,null,{"$f":"IF(M$1019=1,\"\",IF(U928=\"\",\"\",VLOOKUP(U928,Tabelle!$B$4:$O$6,14,FALSE)))","v":""},{"$f":"IF(M$1019=1,\"\",IF(U928=\"\",\"\",VLOOKUP(U928,Tabelle!$B$4:$Q$6,16,FALSE)))","v":""},null,null,null,null,null,null,null,{"$f":"IF(B928=\"\",0,IF(B928=B927,COUNTIF(B$9:B927,B928)+1,1))","v":916},0,0]
["921","-1900","-1900-917",null,null,null,null,null,null,null,null,null,null,null,null,null,null,null,null,null,null,{"$f":"IF(M$1019=1,\"\",IF(U929=\"\",\"\",VLOOKUP(U929,Tabelle!$B$4:$O$6,14,FALSE)))","v":""},{"$f":"IF(M$1019=1,\"\",IF(U929=\"\",\"\",VLOOKUP(U929,Tabelle!$B$4:$Q$6,16,FALSE)))","v":""},null,null,null,null,null,null,null,{"$f":"IF(B929=\"\",0,IF(B929=B928,COUNTIF(B$9:B928,B929)+1,1))","v":917},0,0]
["922","-1900","-1900-918",null,null,null,null,null,null,null,null,null,null,null,null,null,null,null,null,null,null,{"$f":"IF(M$1019=1,\"\",IF(U930=\"\",\"\",VLOOKUP(U930,Tabelle!$B$4:$O$6,14,FALSE)))","v":""},{"$f":"IF(M$1019=1,\"\",IF(U930=\"\",\"\",VLOOKUP(U930,Tabelle!$B$4:$Q$6,16,FALSE)))","v":""},null,null,null,null,null,null,null,{"$f":"IF(B930=\"\",0,IF(B930=B929,COUNTIF(B$9:B929,B930)+1,1))","v":918},0,0]
["923","-1900","-1900-919",null,null,null,null,null,null,null,null,null,null,null,null,null,null,null,null,null,null,{"$f":"IF(M$1019=1,\"\",IF(U931=\"\",\"\",VLOOKUP(U931,Tabelle!$B$4:$O$6,14,FALSE)))","v":""},{"$f":"IF(M$1019=1,\"\",IF(U931=\"\",\"\",VLOOKUP(U931,Tabelle!$B$4:$Q$6,16,FALSE)))","v":""},null,null,null,null,null,null,null,{"$f":"IF(B931=\"\",0,IF(B931=B930,COUNTIF(B$9:B930,B931)+1,1))","v":919},0,0]
["924","-1900","-1900-920",null,null,null,null,null,null,null,null,null,null,null,null,null,null,null,null,null,null,{"$f":"IF(M$1019=1,\"\",IF(U932=\"\",\"\",VLOOKUP(U932,Tabelle!$B$4:$O$6,14,FALSE)))","v":""},{"$f":"IF(M$1019=1,\"\",IF(U932=\"\",\"\",VLOOKUP(U932,Tabelle!$B$4:$Q$6,16,FALSE)))","v":""},null,null,null,null,null,null,null,{"$f":"IF(B932=\"\",0,IF(B932=B931,COUNTIF(B$9:B931,B932)+1,1))","v":920},0,0]
["925","-1900","-1900-921",null,null,null,null,null,null,null,null,null,null,null,null,null,null,null,null,null,null,{"$f":"IF(M$1019=1,\"\",IF(U933=\"\",\"\",VLOOKUP(U933,Tabelle!$B$4:$O$6,14,FALSE)))","v":""},{"$f":"IF(M$1019=1,\"\",IF(U933=\"\",\"\",VLOOKUP(U933,Tabelle!$B$4:$Q$6,16,FALSE)))","v":""},null,null,null,null,null,null,null,{"$f":"IF(B933=\"\",0,IF(B933=B932,COUNTIF(B$9:B932,B933)+1,1))","v":921},0,0]
["926","-1900","-1900-922",null,null,null,null,null,null,null,null,null,null,null,null,null,null,null,null,null,null,{"$f":"IF(M$1019=1,\"\",IF(U934=\"\",\"\",VLOOKUP(U934,Tabelle!$B$4:$O$6,14,FALSE)))","v":""},{"$f":"IF(M$1019=1,\"\",IF(U934=\"\",\"\",VLOOKUP(U934,Tabelle!$B$4:$Q$6,16,FALSE)))","v":""},null,null,null,null,null,null,null,{"$f":"IF(B934=\"\",0,IF(B934=B933,COUNTIF(B$9:B933,B934)+1,1))","v":922},0,0]
["927","-1900","-1900-923",null,null,null,null,null,null,null,null,null,null,null,null,null,null,null,null,null,null,{"$f":"IF(M$1019=1,\"\",IF(U935=\"\",\"\",VLOOKUP(U935,Tabelle!$B$4:$O$6,14,FALSE)))","v":""},{"$f":"IF(M$1019=1,\"\",IF(U935=\"\",\"\",VLOOKUP(U935,Tabelle!$B$4:$Q$6,16,FALSE)))","v":""},null,null,null,null,null,null,null,{"$f":"IF(B935=\"\",0,IF(B935=B934,COUNTIF(B$9:B934,B935)+1,1))","v":923},0,0]
["928","-1900","-1900-924",null,null,null,null,null,null,null,null,null,null,null,null,null,null,null,null,null,null,{"$f":"IF(M$1019=1,\"\",IF(U936=\"\",\"\",VLOOKUP(U936,Tabelle!$B$4:$O$6,14,FALSE)))","v":""},{"$f":"IF(M$1019=1,\"\",IF(U936=\"\",\"\",VLOOKUP(U936,Tabelle!$B$4:$Q$6,16,FALSE)))","v":""},null,null,null,null,null,null,null,{"$f":"IF(B936=\"\",0,IF(B936=B935,COUNTIF(B$9:B935,B936)+1,1))","v":924},0,0]
["929","-1900","-1900-925",null,null,null,null,null,null,null,null,null,null,null,null,null,null,null,null,null,null,{"$f":"IF(M$1019=1,\"\",IF(U937=\"\",\"\",VLOOKUP(U937,Tabelle!$B$4:$O$6,14,FALSE)))","v":""},{"$f":"IF(M$1019=1,\"\",IF(U937=\"\",\"\",VLOOKUP(U937,Tabelle!$B$4:$Q$6,16,FALSE)))","v":""},null,null,null,null,null,null,null,{"$f":"IF(B937=\"\",0,IF(B937=B936,COUNTIF(B$9:B936,B937)+1,1))","v":925},0,0]
["930","-1900","-1900-926",null,null,null,null,null,null,null,null,null,null,null,null,null,null,null,null,null,null,{"$f":"IF(M$1019=1,\"\",IF(U938=\"\",\"\",VLOOKUP(U938,Tabelle!$B$4:$O$6,14,FALSE)))","v":""},{"$f":"IF(M$1019=1,\"\",IF(U938=\"\",\"\",VLOOKUP(U938,Tabelle!$B$4:$Q$6,16,FALSE)))","v":""},null,null,null,null,null,null,null,{"$f":"IF(B938=\"\",0,IF(B938=B937,COUNTIF(B$9:B937,B938)+1,1))","v":926},0,0]
["931","-1900","-1900-927",null,null,null,null,null,null,null,null,null,null,null,null,null,null,null,null,null,null,{"$f":"IF(M$1019=1,\"\",IF(U939=\"\",\"\",VLOOKUP(U939,Tabelle!$B$4:$O$6,14,FALSE)))","v":""},{"$f":"IF(M$1019=1,\"\",IF(U939=\"\",\"\",VLOOKUP(U939,Tabelle!$B$4:$Q$6,16,FALSE)))","v":""},null,null,null,null,null,null,null,{"$f":"IF(B939=\"\",0,IF(B939=B938,COUNTIF(B$9:B938,B939)+1,1))","v":927},0,0]
["932","-1900","-1900-928",null,null,null,null,null,null,null,null,null,null,null,null,null,null,null,null,null,null,{"$f":"IF(M$1019=1,\"\",IF(U940=\"\",\"\",VLOOKUP(U940,Tabelle!$B$4:$O$6,14,FALSE)))","v":""},{"$f":"IF(M$1019=1,\"\",IF(U940=\"\",\"\",VLOOKUP(U940,Tabelle!$B$4:$Q$6,16,FALSE)))","v":""},null,null,null,null,null,null,null,{"$f":"IF(B940=\"\",0,IF(B940=B939,COUNTIF(B$9:B939,B940)+1,1))","v":928},0,0]
["933","-1900","-1900-929",null,null,null,null,null,null,null,null,null,null,null,null,null,null,null,null,null,null,{"$f":"IF(M$1019=1,\"\",IF(U941=\"\",\"\",VLOOKUP(U941,Tabelle!$B$4:$O$6,14,FALSE)))","v":""},{"$f":"IF(M$1019=1,\"\",IF(U941=\"\",\"\",VLOOKUP(U941,Tabelle!$B$4:$Q$6,16,FALSE)))","v":""},null,null,null,null,null,null,null,{"$f":"IF(B941=\"\",0,IF(B941=B940,COUNTIF(B$9:B940,B941)+1,1))","v":929},0,0]
["934","-1900","-1900-930",null,null,null,null,null,null,null,null,null,null,null,null,null,null,null,null,null,null,{"$f":"IF(M$1019=1,\"\",IF(U942=\"\",\"\",VLOOKUP(U942,Tabelle!$B$4:$O$6,14,FALSE)))","v":""},{"$f":"IF(M$1019=1,\"\",IF(U942=\"\",\"\",VLOOKUP(U942,Tabelle!$B$4:$Q$6,16,FALSE)))","v":""},null,null,null,null,null,null,null,{"$f":"IF(B942=\"\",0,IF(B942=B941,COUNTIF(B$9:B941,B942)+1,1))","v":930},0,0]
["935","-1900","-1900-931",null,null,null,null,null,null,null,null,null,null,null,null,null,null,null,null,null,null,{"$f":"IF(M$1019=1,\"\",IF(U943=\"\",\"\",VLOOKUP(U943,Tabelle!$B$4:$O$6,14,FALSE)))","v":""},{"$f":"IF(M$1019=1,\"\",IF(U943=\"\",\"\",VLOOKUP(U943,Tabelle!$B$4:$Q$6,16,FALSE)))","v":""},null,null,null,null,null,null,null,{"$f":"IF(B943=\"\",0,IF(B943=B942,COUNTIF(B$9:B942,B943)+1,1))","v":931},0,0]
["936","-1900","-1900-932",null,null,null,null,null,null,null,null,null,null,null,null,null,null,null,null,null,null,{"$f":"IF(M$1019=1,\"\",IF(U944=\"\",\"\",VLOOKUP(U944,Tabelle!$B$4:$O$6,14,FALSE)))","v":""},{"$f":"IF(M$1019=1,\"\",IF(U944=\"\",\"\",VLOOKUP(U944,Tabelle!$B$4:$Q$6,16,FALSE)))","v":""},null,null,null,null,null,null,null,{"$f":"IF(B944=\"\",0,IF(B944=B943,COUNTIF(B$9:B943,B944)+1,1))","v":932},0,0]
["937","-1900","-1900-933",null,null,null,null,null,null,null,null,null,null,null,null,null,null,null,null,null,null,{"$f":"IF(M$1019=1,\"\",IF(U945=\"\",\"\",VLOOKUP(U945,Tabelle!$B$4:$O$6,14,FALSE)))","v":""},{"$f":"IF(M$1019=1,\"\",IF(U945=\"\",\"\",VLOOKUP(U945,Tabelle!$B$4:$Q$6,16,FALSE)))","v":""},null,null,null,null,null,null,null,{"$f":"IF(B945=\"\",0,IF(B945=B944,COUNTIF(B$9:B944,B945)+1,1))","v":933},0,0]
["938","-1900","-1900-934",null,null,null,null,null,null,null,null,null,null,null,null,null,null,null,null,null,null,{"$f":"IF(M$1019=1,\"\",IF(U946=\"\",\"\",VLOOKUP(U946,Tabelle!$B$4:$O$6,14,FALSE)))","v":""},{"$f":"IF(M$1019=1,\"\",IF(U946=\"\",\"\",VLOOKUP(U946,Tabelle!$B$4:$Q$6,16,FALSE)))","v":""},null,null,null,null,null,null,null,{"$f":"IF(B946=\"\",0,IF(B946=B945,COUNTIF(B$9:B945,B946)+1,1))","v":934},0,0]
["939","-1900",{"$f":"IF(M$1019=1,0,B947&\"-\"&AE947)","v":"-1900-935"},null,null,null,null,null,null,null,null,null,null,null,null,null,null,null,null,null,null,{"$f":"IF(M$1019=1,\"\",IF(U947=\"\",\"\",VLOOKUP(U947,Tabelle!$B$4:$O$6,14,FALSE)))","v":""},{"$f":"IF(M$1019=1,\"\",IF(U947=\"\",\"\",VLOOKUP(U947,Tabelle!$B$4:$Q$6,16,FALSE)))","v":""},null,null,null,null,null,null,null,{"$f":"IF(B947=\"\",0,IF(B947=B946,COUNTIF(B$9:B946,B947)+1,1))","v":935},0,0]
["940","-1900","-1900-936",null,null,null,null,null,null,null,null,null,null,null,null,null,null,null,null,null,null,{"$f":"IF(M$1019=1,\"\",IF(U948=\"\",\"\",VLOOKUP(U948,Tabelle!$B$4:$O$6,14,FALSE)))","v":""},{"$f":"IF(M$1019=1,\"\",IF(U948=\"\",\"\",VLOOKUP(U948,Tabelle!$B$4:$Q$6,16,FALSE)))","v":""},null,null,null,null,null,null,null,{"$f":"IF(B948=\"\",0,IF(B948=B947,COUNTIF(B$9:B947,B948)+1,1))","v":936},0,0]
["941","-1900","-1900-937",null,null,null,null,null,null,null,null,null,null,null,null,null,null,null,null,null,null,{"$f":"IF(M$1019=1,\"\",IF(U949=\"\",\"\",VLOOKUP(U949,Tabelle!$B$4:$O$6,14,FALSE)))","v":""},{"$f":"IF(M$1019=1,\"\",IF(U949=\"\",\"\",VLOOKUP(U949,Tabelle!$B$4:$Q$6,16,FALSE)))","v":""},null,null,null,null,null,null,null,{"$f":"IF(B949=\"\",0,IF(B949=B948,COUNTIF(B$9:B948,B949)+1,1))","v":937},0,0]
["942","-1900","-1900-938",null,null,null,null,null,null,null,null,null,null,null,null,null,null,null,null,null,null,{"$f":"IF(M$1019=1,\"\",IF(U950=\"\",\"\",VLOOKUP(U950,Tabelle!$B$4:$O$6,14,FALSE)))","v":""},{"$f":"IF(M$1019=1,\"\",IF(U950=\"\",\"\",VLOOKUP(U950,Tabelle!$B$4:$Q$6,16,FALSE)))","v":""},null,null,null,null,null,null,null,{"$f":"IF(B950=\"\",0,IF(B950=B949,COUNTIF(B$9:B949,B950)+1,1))","v":938},0,0]
["943","-1900","-1900-939",null,null,null,null,null,null,null,null,null,null,null,null,null,null,null,null,null,null,{"$f":"IF(M$1019=1,\"\",IF(U951=\"\",\"\",VLOOKUP(U951,Tabelle!$B$4:$O$6,14,FALSE)))","v":""},{"$f":"IF(M$1019=1,\"\",IF(U951=\"\",\"\",VLOOKUP(U951,Tabelle!$B$4:$Q$6,16,FALSE)))","v":""},null,null,null,null,null,null,null,{"$f":"IF(B951=\"\",0,IF(B951=B950,COUNTIF(B$9:B950,B951)+1,1))","v":939},0,0]
["944","-1900","-1900-940",null,null,null,null,null,null,null,null,null,null,null,null,null,null,null,null,null,null,{"$f":"IF(M$1019=1,\"\",IF(U952=\"\",\"\",VLOOKUP(U952,Tabelle!$B$4:$O$6,14,FALSE)))","v":""},{"$f":"IF(M$1019=1,\"\",IF(U952=\"\",\"\",VLOOKUP(U952,Tabelle!$B$4:$Q$6,16,FALSE)))","v":""},null,null,null,null,null,null,null,{"$f":"IF(B952=\"\",0,IF(B952=B951,COUNTIF(B$9:B951,B952)+1,1))","v":940},0,0]
["945","-1900","-1900-941",null,null,null,null,null,null,null,null,null,null,null,null,null,null,null,null,null,null,{"$f":"IF(M$1019=1,\"\",IF(U953=\"\",\"\",VLOOKUP(U953,Tabelle!$B$4:$O$6,14,FALSE)))","v":""},{"$f":"IF(M$1019=1,\"\",IF(U953=\"\",\"\",VLOOKUP(U953,Tabelle!$B$4:$Q$6,16,FALSE)))","v":""},null,null,null,null,null,null,null,{"$f":"IF(B953=\"\",0,IF(B953=B952,COUNTIF(B$9:B952,B953)+1,1))","v":941},0,0]
["946","-1900","-1900-942",null,null,null,null,null,null,null,null,null,null,null,null,null,null,null,null,null,null,{"$f":"IF(M$1019=1,\"\",IF(U954=\"\",\"\",VLOOKUP(U954,Tabelle!$B$4:$O$6,14,FALSE)))","v":""},{"$f":"IF(M$1019=1,\"\",IF(U954=\"\",\"\",VLOOKUP(U954,Tabelle!$B$4:$Q$6,16,FALSE)))","v":""},null,null,null,null,null,null,null,{"$f":"IF(B954=\"\",0,IF(B954=B953,COUNTIF(B$9:B953,B954)+1,1))","v":942},0,0]
["947","-1900","-1900-943",null,null,null,null,null,null,null,null,null,null,null,null,null,null,null,null,null,null,{"$f":"IF(M$1019=1,\"\",IF(U955=\"\",\"\",VLOOKUP(U955,Tabelle!$B$4:$O$6,14,FALSE)))","v":""},{"$f":"IF(M$1019=1,\"\",IF(U955=\"\",\"\",VLOOKUP(U955,Tabelle!$B$4:$Q$6,16,FALSE)))","v":""},null,null,null,null,null,null,null,{"$f":"IF(B955=\"\",0,IF(B955=B954,COUNTIF(B$9:B954,B955)+1,1))","v":943},0,0]
["948","-1900","-1900-944",null,null,null,null,null,null,null,null,null,null,null,null,null,null,null,null,null,null,{"$f":"IF(M$1019=1,\"\",IF(U956=\"\",\"\",VLOOKUP(U956,Tabelle!$B$4:$O$6,14,FALSE)))","v":""},{"$f":"IF(M$1019=1,\"\",IF(U956=\"\",\"\",VLOOKUP(U956,Tabelle!$B$4:$Q$6,16,FALSE)))","v":""},null,null,null,null,null,null,null,{"$f":"IF(B956=\"\",0,IF(B956=B955,COUNTIF(B$9:B955,B956)+1,1))","v":944},0,0]
["949","-1900","-1900-945",null,null,null,null,null,null,null,null,null,null,null,null,null,null,null,null,null,null,{"$f":"IF(M$1019=1,\"\",IF(U957=\"\",\"\",VLOOKUP(U957,Tabelle!$B$4:$O$6,14,FALSE)))","v":""},{"$f":"IF(M$1019=1,\"\",IF(U957=\"\",\"\",VLOOKUP(U957,Tabelle!$B$4:$Q$6,16,FALSE)))","v":""},null,null,null,null,null,null,null,{"$f":"IF(B957=\"\",0,IF(B957=B956,COUNTIF(B$9:B956,B957)+1,1))","v":945},0,0]
["950","-1900","-1900-946",null,null,null,null,null,null,null,null,null,null,null,null,null,null,null,null,null,null,{"$f":"IF(M$1019=1,\"\",IF(U958=\"\",\"\",VLOOKUP(U958,Tabelle!$B$4:$O$6,14,FALSE)))","v":""},{"$f":"IF(M$1019=1,\"\",IF(U958=\"\",\"\",VLOOKUP(U958,Tabelle!$B$4:$Q$6,16,FALSE)))","v":""},null,null,null,null,null,null,null,{"$f":"IF(B958=\"\",0,IF(B958=B957,COUNTIF(B$9:B957,B958)+1,1))","v":946},0,0]
["951","-1900","-1900-947",null,null,null,null,null,null,null,null,null,null,null,null,null,null,null,null,null,null,{"$f":"IF(M$1019=1,\"\",IF(U959=\"\",\"\",VLOOKUP(U959,Tabelle!$B$4:$O$6,14,FALSE)))","v":""},{"$f":"IF(M$1019=1,\"\",IF(U959=\"\",\"\",VLOOKUP(U959,Tabelle!$B$4:$Q$6,16,FALSE)))","v":""},null,null,null,null,null,null,null,{"$f":"IF(B959=\"\",0,IF(B959=B958,COUNTIF(B$9:B958,B959)+1,1))","v":947},0,0]
["952","-1900","-1900-948",null,null,null,null,null,null,null,null,null,null,null,null,null,null,null,null,null,null,{"$f":"IF(M$1019=1,\"\",IF(U960=\"\",\"\",VLOOKUP(U960,Tabelle!$B$4:$O$6,14,FALSE)))","v":""},{"$f":"IF(M$1019=1,\"\",IF(U960=\"\",\"\",VLOOKUP(U960,Tabelle!$B$4:$Q$6,16,FALSE)))","v":""},null,null,null,null,null,null,null,{"$f":"IF(B960=\"\",0,IF(B960=B959,COUNTIF(B$9:B959,B960)+1,1))","v":948},0,0]
["953","-1900","-1900-949",null,null,null,null,null,null,null,null,null,null,null,null,null,null,null,null,null,null,{"$f":"IF(M$1019=1,\"\",IF(U961=\"\",\"\",VLOOKUP(U961,Tabelle!$B$4:$O$6,14,FALSE)))","v":""},{"$f":"IF(M$1019=1,\"\",IF(U961=\"\",\"\",VLOOKUP(U961,Tabelle!$B$4:$Q$6,16,FALSE)))","v":""},null,null,null,null,null,null,null,{"$f":"IF(B961=\"\",0,IF(B961=B960,COUNTIF(B$9:B960,B961)+1,1))","v":949},0,0]
["954","-1900","-1900-950",null,null,null,null,null,null,null,null,null,null,null,null,null,null,null,null,null,null,{"$f":"IF(M$1019=1,\"\",IF(U962=\"\",\"\",VLOOKUP(U962,Tabelle!$B$4:$O$6,14,FALSE)))","v":""},{"$f":"IF(M$1019=1,\"\",IF(U962=\"\",\"\",VLOOKUP(U962,Tabelle!$B$4:$Q$6,16,FALSE)))","v":""},null,null,null,null,null,null,null,{"$f":"IF(B962=\"\",0,IF(B962=B961,COUNTIF(B$9:B961,B962)+1,1))","v":950},0,0]
["955","-1900","-1900-951",null,null,null,null,null,null,null,null,null,null,null,null,null,null,null,null,null,null,{"$f":"IF(M$1019=1,\"\",IF(U963=\"\",\"\",VLOOKUP(U963,Tabelle!$B$4:$O$6,14,FALSE)))","v":""},{"$f":"IF(M$1019=1,\"\",IF(U963=\"\",\"\",VLOOKUP(U963,Tabelle!$B$4:$Q$6,16,FALSE)))","v":""},null,null,null,null,null,null,null,{"$f":"IF(B963=\"\",0,IF(B963=B962,COUNTIF(B$9:B962,B963)+1,1))","v":951},0,0]
["956","-1900","-1900-952",null,null,null,null,null,null,null,null,null,null,null,null,null,null,null,null,null,null,{"$f":"IF(M$1019=1,\"\",IF(U964=\"\",\"\",VLOOKUP(U964,Tabelle!$B$4:$O$6,14,FALSE)))","v":""},{"$f":"IF(M$1019=1,\"\",IF(U964=\"\",\"\",VLOOKUP(U964,Tabelle!$B$4:$Q$6,16,FALSE)))","v":""},null,null,null,null,null,null,null,{"$f":"IF(B964=\"\",0,IF(B964=B963,COUNTIF(B$9:B963,B964)+1,1))","v":952},0,0]
["957","-1900","-1900-953",null,null,null,null,null,null,null,null,null,null,null,null,null,null,null,null,null,null,{"$f":"IF(M$1019=1,\"\",IF(U965=\"\",\"\",VLOOKUP(U965,Tabelle!$B$4:$O$6,14,FALSE)))","v":""},{"$f":"IF(M$1019=1,\"\",IF(U965=\"\",\"\",VLOOKUP(U965,Tabelle!$B$4:$Q$6,16,FALSE)))","v":""},null,null,null,null,null,null,null,{"$f":"IF(B965=\"\",0,IF(B965=B964,COUNTIF(B$9:B964,B965)+1,1))","v":953},0,0]
["958","-1900","-1900-954",null,null,null,null,null,null,null,null,null,null,null,null,null,null,null,null,null,null,{"$f":"IF(M$1019=1,\"\",IF(U966=\"\",\"\",VLOOKUP(U966,Tabelle!$B$4:$O$6,14,FALSE)))","v":""},{"$f":"IF(M$1019=1,\"\",IF(U966=\"\",\"\",VLOOKUP(U966,Tabelle!$B$4:$Q$6,16,FALSE)))","v":""},null,null,null,null,null,null,null,{"$f":"IF(B966=\"\",0,IF(B966=B965,COUNTIF(B$9:B965,B966)+1,1))","v":954},0,0]
["959","-1900","-1900-955",null,null,null,null,null,null,null,null,null,null,null,null,null,null,null,null,null,null,{"$f":"IF(M$1019=1,\"\",IF(U967=\"\",\"\",VLOOKUP(U967,Tabelle!$B$4:$O$6,14,FALSE)))","v":""},{"$f":"IF(M$1019=1,\"\",IF(U967=\"\",\"\",VLOOKUP(U967,Tabelle!$B$4:$Q$6,16,FALSE)))","v":""},null,null,null,null,null,null,null,{"$f":"IF(B967=\"\",0,IF(B967=B966,COUNTIF(B$9:B966,B967)+1,1))","v":955},0,0]
["960","-1900","-1900-956",null,null,null,null,null,null,null,null,null,null,null,null,null,null,null,null,null,null,{"$f":"IF(M$1019=1,\"\",IF(U968=\"\",\"\",VLOOKUP(U968,Tabelle!$B$4:$O$6,14,FALSE)))","v":""},{"$f":"IF(M$1019=1,\"\",IF(U968=\"\",\"\",VLOOKUP(U968,Tabelle!$B$4:$Q$6,16,FALSE)))","v":""},null,null,null,null,null,null,null,{"$f":"IF(B968=\"\",0,IF(B968=B967,COUNTIF(B$9:B967,B968)+1,1))","v":956},0,0]
["961","-1900","-1900-957",null,null,null,null,null,null,null,null,null,null,null,null,null,null,null,null,null,null,{"$f":"IF(M$1019=1,\"\",IF(U969=\"\",\"\",VLOOKUP(U969,Tabelle!$B$4:$O$6,14,FALSE)))","v":""},{"$f":"IF(M$1019=1,\"\",IF(U969=\"\",\"\",VLOOKUP(U969,Tabelle!$B$4:$Q$6,16,FALSE)))","v":""},null,null,null,null,null,null,null,{"$f":"IF(B969=\"\",0,IF(B969=B968,COUNTIF(B$9:B968,B969)+1,1))","v":957},0,0]
["962",{"$f":"IF(AG970=$AG$1013,0,IF(M$1019=1,0,D970&\"-\"&YEAR(E970)))","v":"-1900"},"-1900-958",null,null,null,null,null,null,null,null,null,null,null,null,null,null,null,null,null,null,{"$f":"IF(M$1019=1,\"\",IF(U970=\"\",\"\",VLOOKUP(U970,Tabelle!$B$4:$O$6,14,FALSE)))","v":""},{"$f":"IF(M$1019=1,\"\",IF(U970=\"\",\"\",VLOOKUP(U970,Tabelle!$B$4:$Q$6,16,FALSE)))","v":""},null,null,null,null,null,null,null,{"$f":"IF(B970=\"\",0,IF(B970=B969,COUNTIF(B$9:B969,B970)+1,1))","v":958},0,{"$f":"IF(E970>0,IF(OR(MONTH(E970)<$L$1030,MONTH(E970)>$L$1031),AG$1013,0),0)","v":0}]
["963","-1900","-1900-959",null,null,null,null,null,null,null,null,null,null,null,null,null,null,null,null,null,null,{"$f":"IF(M$1019=1,\"\",IF(U971=\"\",\"\",VLOOKUP(U971,Tabelle!$B$4:$O$6,14,FALSE)))","v":""},{"$f":"IF(M$1019=1,\"\",IF(U971=\"\",\"\",VLOOKUP(U971,Tabelle!$B$4:$Q$6,16,FALSE)))","v":""},null,null,null,null,null,null,null,{"$f":"IF(B971=\"\",0,IF(B971=B970,COUNTIF(B$9:B970,B971)+1,1))","v":959},0,0]
["964","-1900","-1900-960",null,null,null,null,null,null,null,null,null,null,null,null,null,null,null,null,null,null,{"$f":"IF(M$1019=1,\"\",IF(U972=\"\",\"\",VLOOKUP(U972,Tabelle!$B$4:$O$6,14,FALSE)))","v":""},{"$f":"IF(M$1019=1,\"\",IF(U972=\"\",\"\",VLOOKUP(U972,Tabelle!$B$4:$Q$6,16,FALSE)))","v":""},null,null,null,null,null,null,null,{"$f":"IF(B972=\"\",0,IF(B972=B971,COUNTIF(B$9:B971,B972)+1,1))","v":960},0,0]
["965","-1900","-1900-961",null,null,null,null,null,null,null,null,null,null,null,null,null,null,null,null,null,null,{"$f":"IF(M$1019=1,\"\",IF(U973=\"\",\"\",VLOOKUP(U973,Tabelle!$B$4:$O$6,14,FALSE)))","v":""},{"$f":"IF(M$1019=1,\"\",IF(U973=\"\",\"\",VLOOKUP(U973,Tabelle!$B$4:$Q$6,16,FALSE)))","v":""},null,null,null,null,null,null,null,{"$f":"IF(B973=\"\",0,IF(B973=B972,COUNTIF(B$9:B972,B973)+1,1))","v":961},0,0]
["966","-1900","-1900-962",null,null,null,null,null,null,null,null,null,null,null,null,null,null,null,null,null,null,{"$f":"IF(M$1019=1,\"\",IF(U974=\"\",\"\",VLOOKUP(U974,Tabelle!$B$4:$O$6,14,FALSE)))","v":""},{"$f":"IF(M$1019=1,\"\",IF(U974=\"\",\"\",VLOOKUP(U974,Tabelle!$B$4:$Q$6,16,FALSE)))","v":""},null,null,null,null,null,null,null,{"$f":"IF(B974=\"\",0,IF(B974=B973,COUNTIF(B$9:B973,B974)+1,1))","v":962},0,0]
["967","-1900","-1900-963",null,null,null,null,null,null,null,null,null,null,null,null,null,null,null,null,null,null,{"$f":"IF(M$1019=1,\"\",IF(U975=\"\",\"\",VLOOKUP(U975,Tabelle!$B$4:$O$6,14,FALSE)))","v":""},{"$f":"IF(M$1019=1,\"\",IF(U975=\"\",\"\",VLOOKUP(U975,Tabelle!$B$4:$Q$6,16,FALSE)))","v":""},null,null,null,null,null,null,null,{"$f":"IF(B975=\"\",0,IF(B975=B974,COUNTIF(B$9:B974,B975)+1,1))","v":963},0,0]
["968","-1900","-1900-964",null,null,null,null,null,null,null,null,null,null,null,null,null,null,null,null,null,null,{"$f":"IF(M$1019=1,\"\",IF(U976=\"\",\"\",VLOOKUP(U976,Tabelle!$B$4:$O$6,14,FALSE)))","v":""},{"$f":"IF(M$1019=1,\"\",IF(U976=\"\",\"\",VLOOKUP(U976,Tabelle!$B$4:$Q$6,16,FALSE)))","v":""},null,null,null,null,null,null,null,{"$f":"IF(B976=\"\",0,IF(B976=B975,COUNTIF(B$9:B975,B976)+1,1))","v":964},0,0]
["969","-1900","-1900-965",null,null,null,null,null,null,null,null,null,null,null,null,null,null,null,null,null,null,{"$f":"IF(M$1019=1,\"\",IF(U977=\"\",\"\",VLOOKUP(U977,Tabelle!$B$4:$O$6,14,FALSE)))","v":""},{"$f":"IF(M$1019=1,\"\",IF(U977=\"\",\"\",VLOOKUP(U977,Tabelle!$B$4:$Q$6,16,FALSE)))","v":""},null,null,null,null,null,null,null,{"$f":"IF(B977=\"\",0,IF(B977=B976,COUNTIF(B$9:B976,B977)+1,1))","v":965},0,0]
["970","-1900","-1900-966",null,null,null,null,null,null,null,null,null,null,null,null,null,null,null,null,null,null,{"$f":"IF(M$1019=1,\"\",IF(U978=\"\",\"\",VLOOKUP(U978,Tabelle!$B$4:$O$6,14,FALSE)))","v":""},{"$f":"IF(M$1019=1,\"\",IF(U978=\"\",\"\",VLOOKUP(U978,Tabelle!$B$4:$Q$6,16,FALSE)))","v":""},null,null,null,null,null,null,null,{"$f":"IF(B978=\"\",0,IF(B978=B977,COUNTIF(B$9:B977,B978)+1,1))","v":966},0,0]
["971","-1900","-1900-967",null,null,null,null,null,null,null,null,null,null,null,null,null,null,null,null,null,null,{"$f":"IF(M$1019=1,\"\",IF(U979=\"\",\"\",VLOOKUP(U979,Tabelle!$B$4:$O$6,14,FALSE)))","v":""},{"$f":"IF(M$1019=1,\"\",IF(U979=\"\",\"\",VLOOKUP(U979,Tabelle!$B$4:$Q$6,16,FALSE)))","v":""},null,null,null,null,null,null,null,{"$f":"IF(B979=\"\",0,IF(B979=B978,COUNTIF(B$9:B978,B979)+1,1))","v":967},0,0]
["972","-1900","-1900-968",null,null,null,null,null,null,null,null,null,null,null,null,null,null,null,null,null,null,{"$f":"IF(M$1019=1,\"\",IF(U980=\"\",\"\",VLOOKUP(U980,Tabelle!$B$4:$O$6,14,FALSE)))","v":""},{"$f":"IF(M$1019=1,\"\",IF(U980=\"\",\"\",VLOOKUP(U980,Tabelle!$B$4:$Q$6,16,FALSE)))","v":""},null,null,null,null,null,null,null,{"$f":"IF(B980=\"\",0,IF(B980=B979,COUNTIF(B$9:B979,B980)+1,1))","v":968},{"$f":"IF(OR(D980=\"\",M$1019=1),0,IF(AE980=8,1,0))","v":0},0]
["973","-1900","-1900-969",null,null,null,null,null,null,null,null,null,null,null,null,null,null,null,null,null,null,{"$f":"IF(M$1019=1,\"\",IF(U981=\"\",\"\",VLOOKUP(U981,Tabelle!$B$4:$O$6,14,FALSE)))","v":""},{"$f":"IF(M$1019=1,\"\",IF(U981=\"\",\"\",VLOOKUP(U981,Tabelle!$B$4:$Q$6,16,FALSE)))","v":""},null,null,null,null,null,null,null,{"$f":"IF(B981=\"\",0,IF(B981=B980,COUNTIF(B$9:B980,B981)+1,1))","v":969},0,0]
["974","-1900","-1900-970",null,null,null,null,null,null,null,null,null,null,null,null,null,null,null,null,null,null,{"$f":"IF(M$1019=1,\"\",IF(U982=\"\",\"\",VLOOKUP(U982,Tabelle!$B$4:$O$6,14,FALSE)))","v":""},{"$f":"IF(M$1019=1,\"\",IF(U982=\"\",\"\",VLOOKUP(U982,Tabelle!$B$4:$Q$6,16,FALSE)))","v":""},null,null,null,null,null,null,null,{"$f":"IF(B982=\"\",0,IF(B982=B981,COUNTIF(B$9:B981,B982)+1,1))","v":970},0,0]
["975","-1900","-1900-971",null,null,null,null,null,null,null,null,null,null,null,null,null,null,null,null,null,null,{"$f":"IF(M$1019=1,\"\",IF(U983=\"\",\"\",VLOOKUP(U983,Tabelle!$B$4:$O$6,14,FALSE)))","v":""},{"$f":"IF(M$1019=1,\"\",IF(U983=\"\",\"\",VLOOKUP(U983,Tabelle!$B$4:$Q$6,16,FALSE)))","v":""},null,null,null,null,null,null,null,{"$f":"IF(B983=\"\",0,IF(B983=B982,COUNTIF(B$9:B982,B983)+1,1))","v":971},0,0]
["976","-1900","-1900-972",null,null,null,null,null,null,null,null,null,null,null,null,null,null,null,null,null,null,{"$f":"IF(M$1019=1,\"\",IF(U984=\"\",\"\",VLOOKUP(U984,Tabelle!$B$4:$O$6,14,FALSE)))","v":""},{"$f":"IF(M$1019=1,\"\",IF(U984=\"\",\"\",VLOOKUP(U984,Tabelle!$B$4:$Q$6,16,FALSE)))","v":""},null,null,null,null,null,null,null,{"$f":"IF(B984=\"\",0,IF(B984=B983,COUNTIF(B$9:B983,B984)+1,1))","v":972},0,0]
["977","-1900","-1900-973",null,null,null,null,null,null,null,null,null,null,null,null,null,null,null,null,null,null,{"$f":"IF(M$1019=1,\"\",IF(U985=\"\",\"\",VLOOKUP(U985,Tabelle!$B$4:$O$6,14,FALSE)))","v":""},{"$f":"IF(M$1019=1,\"\",IF(U985=\"\",\"\",VLOOKUP(U985,Tabelle!$B$4:$Q$6,16,FALSE)))","v":""},null,null,null,null,null,null,null,{"$f":"IF(B985=\"\",0,IF(B985=B984,COUNTIF(B$9:B984,B985)+1,1))","v":973},0,0]
["978","-1900","-1900-974",null,null,null,null,null,null,null,null,null,null,null,null,null,null,null,null,null,null,{"$f":"IF(M$1019=1,\"\",IF(U986=\"\",\"\",VLOOKUP(U986,Tabelle!$B$4:$O$6,14,FALSE)))","v":""},{"$f":"IF(M$1019=1,\"\",IF(U986=\"\",\"\",VLOOKUP(U986,Tabelle!$B$4:$Q$6,16,FALSE)))","v":""},null,null,null,null,null,null,null,{"$f":"IF(B986=\"\",0,IF(B986=B985,COUNTIF(B$9:B985,B986)+1,1))","v":974},0,0]
["979","-1900","-1900-975",null,null,null,null,null,null,null,null,null,null,null,null,null,null,null,null,null,null,{"$f":"IF(M$1019=1,\"\",IF(U987=\"\",\"\",VLOOKUP(U987,Tabelle!$B$4:$O$6,14,FALSE)))","v":""},{"$f":"IF(M$1019=1,\"\",IF(U987=\"\",\"\",VLOOKUP(U987,Tabelle!$B$4:$Q$6,16,FALSE)))","v":""},null,null,null,null,null,null,null,{"$f":"IF(B987=\"\",0,IF(B987=B986,COUNTIF(B$9:B986,B987)+1,1))","v":975},0,0]
["980","-1900","-1900-976",null,null,null,null,null,null,null,null,null,null,null,null,null,null,null,null,null,null,{"$f":"IF(M$1019=1,\"\",IF(U988=\"\",\"\",VLOOKUP(U988,Tabelle!$B$4:$O$6,14,FALSE)))","v":""},{"$f":"IF(M$1019=1,\"\",IF(U988=\"\",\"\",VLOOKUP(U988,Tabelle!$B$4:$Q$6,16,FALSE)))","v":""},null,null,null,null,null,null,null,{"$f":"IF(B988=\"\",0,IF(B988=B987,COUNTIF(B$9:B987,B988)+1,1))","v":976},0,0]
["981","-1900","-1900-977",null,null,null,null,null,null,null,null,null,null,null,null,null,null,null,null,null,null,{"$f":"IF(M$1019=1,\"\",IF(U989=\"\",\"\",VLOOKUP(U989,Tabelle!$B$4:$O$6,14,FALSE)))","v":""},{"$f":"IF(M$1019=1,\"\",IF(U989=\"\",\"\",VLOOKUP(U989,Tabelle!$B$4:$Q$6,16,FALSE)))","v":""},null,null,null,null,null,null,null,{"$f":"IF(B989=\"\",0,IF(B989=B988,COUNTIF(B$9:B988,B989)+1,1))","v":977},0,0]
["982","-1900","-1900-978",null,null,null,null,null,null,null,null,null,null,null,null,null,null,null,null,null,null,{"$f":"IF(M$1019=1,\"\",IF(U990=\"\",\"\",VLOOKUP(U990,Tabelle!$B$4:$O$6,14,FALSE)))","v":""},{"$f":"IF(M$1019=1,\"\",IF(U990=\"\",\"\",VLOOKUP(U990,Tabelle!$B$4:$Q$6,16,FALSE)))","v":""},null,null,null,null,null,null,null,{"$f":"IF(B990=\"\",0,IF(B990=B989,COUNTIF(B$9:B989,B990)+1,1))","v":978},0,0]
["983","-1900","-1900-979",null,null,null,null,null,null,null,null,null,null,null,null,null,null,null,null,null,null,{"$f":"IF(M$1019=1,\"\",IF(U991=\"\",\"\",VLOOKUP(U991,Tabelle!$B$4:$O$6,14,FALSE)))","v":""},{"$f":"IF(M$1019=1,\"\",IF(U991=\"\",\"\",VLOOKUP(U991,Tabelle!$B$4:$Q$6,16,FALSE)))","v":""},null,null,null,null,null,null,null,{"$f":"IF(B991=\"\",0,IF(B991=B990,COUNTIF(B$9:B990,B991)+1,1))","v":979},0,0]
["984","-1900","-1900-980",null,null,null,null,null,null,null,null,null,null,null,null,null,null,null,null,null,null,{"$f":"IF(M$1019=1,\"\",IF(U992=\"\",\"\",VLOOKUP(U992,Tabelle!$B$4:$O$6,14,FALSE)))","v":""},{"$f":"IF(M$1019=1,\"\",IF(U992=\"\",\"\",VLOOKUP(U992,Tabelle!$B$4:$Q$6,16,FALSE)))","v":""},null,null,null,null,null,null,null,{"$f":"IF(B992=\"\",0,IF(B992=B991,COUNTIF(B$9:B991,B992)+1,1))","v":980},0,0]
["985","-1900","-1900-981",null,null,null,null,null,null,null,null,null,null,null,null,null,null,null,null,null,null,{"$f":"IF(M$1019=1,\"\",IF(U993=\"\",\"\",VLOOKUP(U993,Tabelle!$B$4:$O$6,14,FALSE)))","v":""},{"$f":"IF(M$1019=1,\"\",IF(U993=\"\",\"\",VLOOKUP(U993,Tabelle!$B$4:$Q$6,16,FALSE)))","v":""},null,null,null,null,null,null,null,{"$f":"IF(B993=\"\",0,IF(B993=B992,COUNTIF(B$9:B992,B993)+1,1))","v":981},0,0]
["986","-1900","-1900-982",null,null,null,null,null,null,null,null,null,null,null,null,null,null,null,null,null,null,{"$f":"IF(M$1019=1,\"\",IF(U994=\"\",\"\",VLOOKUP(U994,Tabelle!$B$4:$O$6,14,FALSE)))","v":""},{"$f":"IF(M$1019=1,\"\",IF(U994=\"\",\"\",VLOOKUP(U994,Tabelle!$B$4:$Q$6,16,FALSE)))","v":""},null,null,null,null,null,null,null,{"$f":"IF(B994=\"\",0,IF(B994=B993,COUNTIF(B$9:B993,B994)+1,1))","v":982},0,0]
["987","-1900","-1900-983",null,null,null,null,null,null,null,null,null,null,null,null,null,null,null,null,null,null,{"$f":"IF(M$1019=1,\"\",IF(U995=\"\",\"\",VLOOKUP(U995,Tabelle!$B$4:$O$6,14,FALSE)))","v":""},{"$f":"IF(M$1019=1,\"\",IF(U995=\"\",\"\",VLOOKUP(U995,Tabelle!$B$4:$Q$6,16,FALSE)))","v":""},null,null,null,null,null,null,null,{"$f":"IF(B995=\"\",0,IF(B995=B994,COUNTIF(B$9:B994,B995)+1,1))","v":983},0,0]
["988","-1900","-1900-984",null,null,null,null,null,null,null,null,null,null,null,null,null,null,null,null,null,null,{"$f":"IF(M$1019=1,\"\",IF(U996=\"\",\"\",VLOOKUP(U996,Tabelle!$B$4:$O$6,14,FALSE)))","v":""},{"$f":"IF(M$1019=1,\"\",IF(U996=\"\",\"\",VLOOKUP(U996,Tabelle!$B$4:$Q$6,16,FALSE)))","v":""},null,null,null,null,null,null,null,{"$f":"IF(B996=\"\",0,IF(B996=B995,COUNTIF(B$9:B995,B996)+1,1))","v":984},0,0]
["989","-1900","-1900-985",null,null,null,null,null,null,null,null,null,null,null,null,null,null,null,null,null,null,{"$f":"IF(M$1019=1,\"\",IF(U997=\"\",\"\",VLOOKUP(U997,Tabelle!$B$4:$O$6,14,FALSE)))","v":""},{"$f":"IF(M$1019=1,\"\",IF(U997=\"\",\"\",VLOOKUP(U997,Tabelle!$B$4:$Q$6,16,FALSE)))","v":""},null,null,null,null,null,null,null,{"$f":"IF(B997=\"\",0,IF(B997=B996,COUNTIF(B$9:B996,B997)+1,1))","v":985},0,0]
["990","-1900","-1900-986",null,null,null,null,null,null,null,null,null,null,null,null,null,null,null,null,null,null,{"$f":"IF(M$1019=1,\"\",IF(U998=\"\",\"\",VLOOKUP(U998,Tabelle!$B$4:$O$6,14,FALSE)))","v":""},{"$f":"IF(M$1019=1,\"\",IF(U998=\"\",\"\",VLOOKUP(U998,Tabelle!$B$4:$Q$6,16,FALSE)))","v":""},null,null,null,null,null,null,null,{"$f":"IF(B998=\"\",0,IF(B998=B997,COUNTIF(B$9:B997,B998)+1,1))","v":986},0,0]
["991","-1900","-1900-987",null,null,null,null,null,null,null,null,null,null,null,null,null,null,null,null,null,null,{"$f":"IF(M$1019=1,\"\",IF(U999=\"\",\"\",VLOOKUP(U999,Tabelle!$B$4:$O$6,14,FALSE)))","v":""},{"$f":"IF(M$1019=1,\"\",IF(U999=\"\",\"\",VLOOKUP(U999,Tabelle!$B$4:$Q$6,16,FALSE)))","v":""},null,null,null,null,null,null,null,{"$f":"IF(B999=\"\",0,IF(B999=B998,COUNTIF(B$9:B998,B999)+1,1))","v":987},0,0]
["992","-1900","-1900-988",null,null,null,null,null,null,null,null,null,null,null,null,null,null,null,null,null,null,{"$f":"IF(M$1019=1,\"\",IF(U1000=\"\",\"\",VLOOKUP(U1000,Tabelle!$B$4:$O$6,14,FALSE)))","v":""},{"$f":"IF(M$1019=1,\"\",IF(U1000=\"\",\"\",VLOOKUP(U1000,Tabelle!$B$4:$Q$6,16,FALSE)))","v":""},null,null,null,null,null,null,null,{"$f":"IF(B1000=\"\",0,IF(B1000=B999,COUNTIF(B$9:B999,B1000)+1,1))","v":988},0,0]
["993","-1900","-1900-989",null,null,null,null,null,null,null,null,null,null,null,null,null,null,null,null,null,null,{"$f":"IF(M$1019=1,\"\",IF(U1001=\"\",\"\",VLOOKUP(U1001,Tabelle!$B$4:$O$6,14,FALSE)))","v":""},{"$f":"IF(M$1019=1,\"\",IF(U1001=\"\",\"\",VLOOKUP(U1001,Tabelle!$B$4:$Q$6,16,FALSE)))","v":""},null,null,null,null,null,null,null,{"$f":"IF(B1001=\"\",0,IF(B1001=B1000,COUNTIF(B$9:B1000,B1001)+1,1))","v":989},0,0]
["994","-1900","-1900-990",null,null,null,null,null,null,null,null,null,null,null,null,null,null,null,null,null,null,{"$f":"IF(M$1019=1,\"\",IF(U1002=\"\",\"\",VLOOKUP(U1002,Tabelle!$B$4:$O$6,14,FALSE)))","v":""},{"$f":"IF(M$1019=1,\"\",IF(U1002=\"\",\"\",VLOOKUP(U1002,Tabelle!$B$4:$Q$6,16,FALSE)))","v":""},null,null,null,null,null,null,null,{"$f":"IF(B1002=\"\",0,IF(B1002=B1001,COUNTIF(B$9:B1001,B1002)+1,1))","v":990},0,0]
["995","-1900","-1900-991",null,null,null,null,null,null,null,null,null,null,null,null,null,null,null,null,null,null,{"$f":"IF(M$1019=1,\"\",IF(U1003=\"\",\"\",VLOOKUP(U1003,Tabelle!$B$4:$O$6,14,FALSE)))","v":""},{"$f":"IF(M$1019=1,\"\",IF(U1003=\"\",\"\",VLOOKUP(U1003,Tabelle!$B$4:$Q$6,16,FALSE)))","v":""},null,null,null,null,null,null,null,{"$f":"IF(B1003=\"\",0,IF(B1003=B1002,COUNTIF(B$9:B1002,B1003)+1,1))","v":991},0,0]
["996","-1900","-1900-992",null,null,null,null,null,null,null,null,null,null,null,null,null,null,null,null,null,null,{"$f":"IF(M$1019=1,\"\",IF(U1004=\"\",\"\",VLOOKUP(U1004,Tabelle!$B$4:$O$6,14,FALSE)))","v":""},{"$f":"IF(M$1019=1,\"\",IF(U1004=\"\",\"\",VLOOKUP(U1004,Tabelle!$B$4:$Q$6,16,FALSE)))","v":""},null,null,null,null,null,null,null,{"$f":"IF(B1004=\"\",0,IF(B1004=B1003,COUNTIF(B$9:B1003,B1004)+1,1))","v":992},0,0]
["997","-1900","-1900-993",null,null,null,null,null,null,null,null,null,null,null,null,null,null,null,null,null,null,{"$f":"IF(M$1019=1,\"\",IF(U1005=\"\",\"\",VLOOKUP(U1005,Tabelle!$B$4:$O$6,14,FALSE)))","v":""},{"$f":"IF(M$1019=1,\"\",IF(U1005=\"\",\"\",VLOOKUP(U1005,Tabelle!$B$4:$Q$6,16,FALSE)))","v":""},null,null,null,null,null,null,null,{"$f":"IF(B1005=\"\",0,IF(B1005=B1004,COUNTIF(B$9:B1004,B1005)+1,1))","v":993},0,0]
["998","-1900","-1900-994",null,null,null,null,null,null,null,null,null,null,null,null,null,null,null,null,null,null,{"$f":"IF(M$1019=1,\"\",IF(U1006=\"\",\"\",VLOOKUP(U1006,Tabelle!$B$4:$O$6,14,FALSE)))","v":""},{"$f":"IF(M$1019=1,\"\",IF(U1006=\"\",\"\",VLOOKUP(U1006,Tabelle!$B$4:$Q$6,16,FALSE)))","v":""},null,null,null,null,null,null,null,{"$f":"IF(B1006=\"\",0,IF(B1006=B1005,COUNTIF(B$9:B1005,B1006)+1,1))","v":994},0,0]
["999","-1900","-1900-995",null,null,null,null,null,null,null,null,null,null,null,null,null,null,null,null,null,null,{"$f":"IF(M$1019=1,\"\",IF(U1007=\"\",\"\",VLOOKUP(U1007,Tabelle!$B$4:$O$6,14,FALSE)))","v":""},{"$f":"IF(M$1019=1,\"\",IF(U1007=\"\",\"\",VLOOKUP(U1007,Tabelle!$B$4:$Q$6,16,FALSE)))","v":""},null,null,null,null,null,null,null,{"$f":"IF(B1007=\"\",0,IF(B1007=B1006,COUNTIF(B$9:B1006,B1007)+1,1))","v":995},0,0]
["1000","-1900","-1900-996",null,null,null,null,null,null,null,null,null,null,null,null,null,null,null,null,null,null,{"$f":"IF(M$1019=1,\"\",IF(U1008=\"\",\"\",VLOOKUP(U1008,Tabelle!$B$4:$O$6,14,FALSE)))","v":""},{"$f":"IF(M$1019=1,\"\",IF(U1008=\"\",\"\",VLOOKUP(U1008,Tabelle!$B$4:$Q$6,16,FALSE)))","v":""},null,null,null,null,null,null,null,{"$f":"IF(B1008=\"\",0,IF(B1008=B1007,COUNTIF(B$9:B1007,B1008)+1,1))","v":996},0,0]
[]
[]
[null,null,null,null,null,null,null,null,null,"Righe di Prot.",{"$f":"SUBTOTAL(3,D9:D1008)","v":4},{"$f":"SUBTOTAL(9,L9:L1008)","v":16000},"Subtotali"]
[]
[null,null,null,null,null,null,null,null,null,null,{"$f":"CONTRIBUENTE!G13","v":""},null,null,null,null,null,null,null,null,null,null,null,null,null,null,null,null,null,"Hai dei PROTOCOLLI BLOCCATI nelle date di un trimestre al momento non attivato.",null,null,null,"P. B."]
[null,null,null,{"$f":"CONCATENATE(CONTRIBUENTE!J27,\"   -   www.marcopiccoli.it\")","v":"F23 1.6 per Excel .xlsm   -   www.marcopiccoli.it"},null,null,null,null,null,null,{"$f":"IF(CONTRIBUENTE!J144=CONTRIBUENTE!K68,CONCATENATE(CONTRIBUENTE!F62,\"   -   \",\"P.I./C.F \",CONTRIBUENTE!K64),CONTRIBUENTE!J136)","v":"Sistema attivato dal 01/01 al 31/03. Modifica il trimestre dal foglio Presentazione."},null,null,null,null,null,null,null,null,null,null,null,null,null,null,null,null,null,"Modifica il trimestre dal foglio CONTRIBUENTE oppure richiedi il tuo codice di proprietà per l' attivazione illimitata.",null,null,null,{"$f":"COUNTIF(AG9:AG1008,AG1013)","v":0}]
[]
[]
[]
[null,null,null,null,null,null,null,null,null,null,"Integrità","BIT INTEGRITA'","File scaduto",null,null,"Proprietà"]
[null,null,null,{"$f":"Tabelle!B4","v":"B1"},null,null,{"$f":"Tabelle!U33","v":"PV"},{"$f":"Tabelle!Q33","v":"Inserisci Provincia"},null,null,{"$f":"CONTRIBUENTE!K138","v":4},1,{"$f":"CONTRIBUENTE!$H$138","v":0},null,null,{"$f":"CONTRIBUENTE!E139","v":0}]
[null,null,null,{"$f":"Tabelle!B5","v":"B2"},null,null,{"$f":"Tabelle!U34","v":"MI"},{"$f":"Tabelle!Q34","v":"MILANO"}]
[null,null,null,{"$f":"Tabelle!B6","v":"B3"},null,null,{"$f":"Tabelle!U35","v":"RO"},{"$f":"Tabelle!Q35","v":"R O M A"}]
[null,null,null,null,null,null,{"$f":"Tabelle!U36","v":"PA"},{"$f":"Tabelle!Q36","v":"PALERMO"},null,"Protocolli",1]
[null,null,null,null,null,null,{"$f":"Tabelle!U37","v":" "},{"$f":"Tabelle!Q37","v":0},null,"disponibili",9999]
[null,null,null,{"$f":"Tabelle!G14","v":1},null,null,{"$f":"Tabelle!U38","v":" "},{"$f":"Tabelle!Q38","v":0}]
[null,null,null,{"$f":"Tabelle!G15","v":2},null,null,{"$f":"Tabelle!U39","v":" "},{"$f":"Tabelle!Q39","v":0}]
[null,null,null,{"$f":"Tabelle!G16","v":3},null,null,{"$f":"Tabelle!U40","v":" "},{"$f":"Tabelle!Q40","v":0}]
[null,null,null,{"$f":"Tabelle!G17","v":4},null,null,{"$f":"Tabelle!U41","v":" "},{"$f":"Tabelle!Q41","v":0}]
[null,null,null,{"$f":"Tabelle!G18","v":5},null,null,{"$f":"Tabelle!U42","v":" "},{"$f":"Tabelle!Q42","v":0}]
[null,null,null,{"$f":"Tabelle!G19","v":6},null,null,{"$f":"Tabelle!U43","v":" "},{"$f":"Tabelle!Q43","v":0}]
[null,null,null,{"$f":"Tabelle!G20","v":"."},null,null,{"$f":"Tabelle!U44","v":" "},{"$f":"Tabelle!Q44","v":0},null,"1900-01-01","convalida START",{"$f":"IF(P1019=1,MONTH(J1030),MONTH(CONTRIBUENTE!$T$13))","v":1},"convalida Protocollo START MESE"]
[null,null,null,null,null,null,{"$f":"Tabelle!U45","v":" "},{"$f":"Tabelle!Q45","v":0},null,"2999-12-31","convalida END",{"$f":"IF(P1019=1,MONTH(J1031),MONTH(CONTRIBUENTE!$U$13))","v":3},"convalida Protocollo END MESE"]
[null,null,null,null,null,null,{"$f":"Tabelle!U46","v":" "},{"$f":"Tabelle!Q46","v":0}]
[null,null,null,{"$f":"Tabelle!U14","v":"IN"},null,null,{"$f":"Tabelle!U47","v":" "},{"$f":"Tabelle!Q47","v":0}]
[null,null,null,{"$f":"Tabelle!U15","v":"VT"},null,null,{"$f":"Tabelle!U48","v":" "},{"$f":"Tabelle!Q48","v":0}]
[null,null,null,{"$f":"Tabelle!U16","v":"RG"},null,null,{"$f":"Tabelle!U49","v":" "},{"$f":"Tabelle!Q49","v":0}]
[null,null,null,{"$f":"Tabelle!U17","v":"RP"},null,null,{"$f":"Tabelle!U50","v":" "},{"$f":"Tabelle!Q50","v":0}]
[null,null,null,{"$f":"Tabelle!U18","v":"SZ"},null,null,{"$f":"Tabelle!U51","v":" "},{"$f":"Tabelle!Q51","v":0}]
[null,null,null,{"$f":"Tabelle!U19","v":"SA"},null,null,{"$f":"Tabelle!U52","v":" "},{"$f":"Tabelle!Q52","v":0}]
[null,null,null,{"$f":"Tabelle!U20","v":"CR"},null,null,{"$f":"Tabelle!U53","v":" "},{"$f":"Tabelle!Q53","v":0}]
[null,null,null,{"$f":"Tabelle!U21","v":"DR"},null,null,{"$f":"Tabelle!U54","v":" "},{"$f":"Tabelle!Q54","v":0}]
[null,null,null,{"$f":"Tabelle!U22","v":"IR"},null,null,{"$f":"Tabelle!U55","v":" "},{"$f":"Tabelle!Q55","v":0}]
[null,null,null,{"$f":"Tabelle!U23","v":"ED"},null,null,{"$f":"Tabelle!U56","v":" "},{"$f":"Tabelle!Q56","v":0}]
[null,null,null,{"$f":"Tabelle!U24","v":"EP"},null,null,{"$f":"Tabelle!U57","v":" "},{"$f":"Tabelle!Q57","v":0}]
[null,null,null,{"$f":"Tabelle!U25","v":"TR"},null,null,{"$f":"Tabelle!U58","v":" "},{"$f":"Tabelle!Q58","v":0}]
[null,null,null,{"$f":"Tabelle!U26","v":"MR"},null,null,{"$f":"Tabelle!U59","v":" "},{"$f":"Tabelle!Q59","v":0}]
[null,null,null,{"$f":"Tabelle!U27","v":"PA"},null,null,{"$f":"Tabelle!U60","v":" "},{"$f":"Tabelle!Q60","v":0}]
[null,null,null,{"$f":"Tabelle!U28","v":".."},null,null,{"$f":"Tabelle!U61","v":" "},{"$f":"Tabelle!Q61","v":0}]
[null,null,null,{"$f":"Tabelle!U29","v":".."},null,null,{"$f":"Tabelle!U62","v":" "},{"$f":"Tabelle!Q62","v":0}]
[null,null,null,null,null,null,{"$f":"Tabelle!U63","v":" "},{"$f":"Tabelle!Q63","v":0}]
[null,null,null,null,null,null,{"$f":"Tabelle!U64","v":" "},{"$f":"Tabelle!Q64","v":0}]
[null,null,null,null,null,null,{"$f":"Tabelle!U65","v":" "},{"$f":"Tabelle!Q65","v":0}]
[null,null,null,null,null,null,{"$f":"Tabelle!U66","v":" "},{"$f":"Tabelle!Q66","v":0}]
[null,null,null,null,null,null,{"$f":"Tabelle!U67","v":" "},{"$f":"Tabelle!Q67","v":0}]
[null,null,null,null,null,null,{"$f":"Tabelle!U68","v":" "},{"$f":"Tabelle!Q68","v":0}]
[null,null,null,null,null,null,{"$f":"Tabelle!U69","v":" "},{"$f":"Tabelle!Q69","v":0}]
[null,null,null,null,null,null,{"$f":"Tabelle!U70","v":" "},{"$f":"Tabelle!Q70","v":0}]
[null,null,null,null,null,null,{"$f":"Tabelle!U71","v":" "},{"$f":"Tabelle!Q71","v":0}]
[null,null,null,null,null,null,{"$f":"Tabelle!U72","v":" "},{"$f":"Tabelle!Q72","v":0}]
[null,null,null,null,null,null,{"$f":"Tabelle!U73","v":" "},{"$f":"Tabelle!Q73","v":0}]
[null,null,null,null,null,null,{"$f":"Tabelle!U74","v":" "},{"$f":"Tabelle!Q74","v":0}]
[null,null,null,null,null,null,{"$f":"Tabelle!U75","v":" "},{"$f":"Tabelle!Q75","v":0}]
[null,null,null,null,null,null,{"$f":"Tabelle!U76","v":" "},{"$f":"Tabelle!Q76","v":0}]
[null,null,null,null,null,null,{"$f":"Tabelle!U77","v":" "},{"$f":"Tabelle!Q77","v":0}]
[null,null,null,null,null,null,{"$f":"Tabelle!U78","v":" "},{"$f":"Tabelle!Q78","v":0}]
[null,null,null,null,null,null,{"$f":"Tabelle!U79","v":" "},{"$f":"Tabelle!Q79","v":0}]
[null,null,null,null,null,null,{"$f":"Tabelle!U80","v":" "},{"$f":"Tabelle!Q80","v":0}]
[null,null,null,null,null,null,{"$f":"Tabelle!U81","v":" "},{"$f":"Tabelle!Q81","v":0}]
[null,null,null,null,null,null,{"$f":"Tabelle!U82","v":"."},{"$f":"Tabelle!Q82","v":0}]

{"sheet":"F 23","index":2,"n_rows":55,"n_cols":50,"rows_kept":55,"cut":false,"hidden":false,"merged":[[39,4,39,26],[46,6,46,17],[45,6,45,17],[51,12,51,18],[52,12,52,18],[53,12,53,18],[53,19,53,25],[51,5,51,11],[43,1,43,5],[44,1,44,5],[45,1,45,5],[46,1,46,5],[52,5,52,11],[42,1,42,5],[11,49,12,49],[23,11,23,27],[43,6,43,17],[44,6,44,17],[12,2,12,25],[12,26,12,37],[12,39,12,40],[12,41,12,42],[14,3,14,4],[14,10,14,23],[29,11,29,27],[14,27,14,28],[14,39,14,40],[16,2,16,25],[16,26,16,37],[16,39,16,40],[18,3,18,4],[18,10,18,23],[18,27,18,28],[18,39,18,40],[29,3,29,4],[30,3,30,4],[24,1,24,2],[25,1,25,2],[56,43,56,44],[18,41,18,42],[14,41,14,42],[21,41,21,42],[30,40,30,41],[16,41,16,42],[27,40,27,41],[28,40,28,41],[29,40,29,41],[23,40,23,41],[51,37,51,41],[52,37,52,41],[28,38,28,39],[29,38,29,39],[30,38,30,39],[33,1,33,47],[29,7,29,8],[30,7,30,8],[28,30,28,37],[29,30,29,37],[30,30,30,37],[36,10,36,11],[54,12,54,18],[51,43,51,46],[3,23,3,47],[5,23,5,47],[7,45,7,47],[7,27,7,43],[23,30,23,37],[21,2,21,3],[21,27,21,28],[21,39,21,40],[23,1,23,2],[23,3,23,4],[21,23,21,24],[21,6,21,7],[23,5,23,6],[23,7,23,8],[23,38,23,39],[21,4,21,5],[26,1,26,2],[27,1,27,2],[24,30,24,37],[25,30,25,37],[26,30,26,37],[27,30,27,37],[30,5,30,6],[25,7,25,8],[26,7,26,8],[27,7,27,8],[25,5,25,6],[26,5,26,6],[27,5,27,6],[28,5,28,6],[24,5,24,6],[24,7,24,8],[24,11,24,27],[29,5,29,6],[30,11,30,27],[25,11,25,27],[26,11,26,27],[27,11,27,27],[28,11,28,27],[28,7,28,8],[36,14,36,20],[36,21,36,27],[36,1,36,2],[36,3,36,4],[36,5,36,6],[36,7,36,8],[24,40,24,41],[25,40,25,41],[26,40,26,41],[31,30,31,37],[31,38,31,39],[31,40,31,41],[24,38,24,39],[25,38,25,39],[26,38,26,39],[27,38,27,39],[28,1,28,2],[29,1,29,2],[30,1,30,2],[24,3,24,4],[25,3,25,4],[26,3,26,4],[27,3,27,4],[28,3,28,4]]}
[]
[null,null,null,null,null,null,null,null,null,null,null,null,null,null,null,null,null,null,null,null,null,null,null,null,null,null,null,null,null,null,null,null,null,null,null,null,null,null,null,null,null,null,null,null,null,null,null,null,null,"ANNO"]
[null,null,null,null,null,null,null,null,null,null,null,null,null,null,null,null,null,null,null,null,null,null,null,null,null,null,null,null,null,null,null,null,null,null,null,null,null,null,null,null,null,null,null,null,null,null,null,null,null,2024]
[null,null,null,null,null,null,null,null,null,null,null,null,null,null,null,null,null,null,null,null,null,null,null,{"$f":"VLOOKUP(VLOOKUP(AX5&\"-\"&AX3,'DATI del VERSAMENTO'!B9:G1008,6,FALSE),'DATI del VERSAMENTO'!G1019:H1068,2,FALSE)","v":"Inserisci Provincia"},null,null,null,null,null,null,null,null,null,null,null,null,null,null,null,null,null,null,null,null,null,null,null,null,null,"Protocollo DOC."]
[null,null,null,null,null,null,null,null,null,null,null,null,null,null,null,null,null,null,null,null,null,null,null,null,null,null,null,null,null,null,null,null,null,null,null,null,null,null,null,null,null,null,null,null,null,null,null,null,null,1]
[null,null,null,null,null,null,null,null,null,null,null,null,null,null,null,null,null,null,null,null,null,null,null,{"$f":"VLOOKUP(VLOOKUP(AX5&\"-\"&AX3,'DATI del VERSAMENTO'!B9:U1008,20,FALSE),Tabelle!B4:C6,2,FALSE)","v":"Nome Banca 1 / modifica sigla"}]
[]
[null,null,null,null,null,null,null,null,null,null,null,null,null,null,null,null,null,null,null,null,null,null,null,null,null,null,null,{"$f":"VLOOKUP(VLOOKUP(AX5&\"-\"&AX3,'DATI del VERSAMENTO'!B9:U1008,20,FALSE),Tabelle!B4:I6,8,FALSE)","v":"Nome Agenzia 1"},null,null,null,null,null,null,null,null,null,null,null,null,null,null,null,null,null,{"$f":"VLOOKUP(VLOOKUP(AX5&\"-\"&AX3,'DATI del VERSAMENTO'!B9:U1008,20,FALSE),Tabelle!B4:N6,13,FALSE)","v":"XX"}]
[]
[]
[null,null,null,null,null,null,null,null,null,null,null,null,null,null,null,null,null,null,null,null,null,null,null,null,null,null,null,null,null,null,null,null,null,null,null,null,null,null,null,null,null,null,null,null,null,null,null,null,null,"Alfanumerico"]
[null,null,null,null,null,null,null,null,null,null,null,null,null,null,null,null,null,null,null,null,null,null,null,null,null,null,null,null,null,null,null,null,null,null,null,null,null,null,null,null,null,null,null,null,null,null,null,null,null,{"$f":"VLOOKUP($AX$5&\"-\"&$AX$3,'DATI del VERSAMENTO'!$B$9:$AA$1008,26,FALSE)","v":"AB 100"}]
[null,null,{"$f":"CONTRIBUENTE!E34","v":"Anagrafica CONTRIBUENTE"},null,null,null,null,null,null,null,null,null,null,null,null,null,null,null,null,null,null,null,null,null,null,null,{"$f":"CONTRIBUENTE!E36","v":"Nome CONTRIBUENTE"},null,null,null,null,null,null,null,null,null,null,null,{"$f":"MID(TEXT(CONTRIBUENTE!J36,\"gg/mm/aaaa\"),1,1)","v":"0"},{"$f":"MID(TEXT(CONTRIBUENTE!J36,\"gg/mm/aaaa\"),2,1)","v":"1"},null,{"$f":"MID(TEXT(CONTRIBUENTE!J36,\"gg/mm/aaaa\"),4,1)","v":"0"},null,{"$f":"MID(TEXT(CONTRIBUENTE!J36,\"gg/mm/aaaa\"),5,1)","v":"1"},{"$f":"MID(TEXT(CONTRIBUENTE!J36,\"gg/mm/aaaa\"),7,1)","v":"2"},{"$f":"MID(TEXT(CONTRIBUENTE!J36,\"gg/mm/aaaa\"),8,1)","v":"0"},{"$f":"MID(TEXT(CONTRIBUENTE!J36,\"gg/mm/aaaa\"),9,1)","v":"0"},{"$f":"MID(TEXT(CONTRIBUENTE!J36,\"gg/mm/aaaa\"),10,1)","v":"0"}]
[]
[null,null,null,{"$f":"VLOOKUP(CONTRIBUENTE!M36,CONTRIBUENTE!$E$148:$F$149,2,FALSE)","v":{"$error":"#N/A"}},null,null,null,null,null,null,{"$f":"CONTRIBUENTE!D38","v":0},null,null,null,null,null,null,null,null,null,null,null,null,null,null,null,{"$f":"LEFT(CONTRIBUENTE!H38,1)","v":""},{"$f":"RIGHT(CONTRIBUENTE!H38,1)","v":""},null,null,{"$f":"MID(CONTRIBUENTE!$J38,1,1)","v":"0"},{"$f":"MID(CONTRIBUENTE!$J38,2,1)","v":"1"},{"$f":"MID(CONTRIBUENTE!$J38,3,1)","v":"2"},{"$f":"MID(CONTRIBUENTE!$J38,4,1)","v":"3"},{"$f":"MID(CONTRIBUENTE!$J38,5,1)","v":"4"},{"$f":"MID(CONTRIBUENTE!$J38,6,1)","v":"5"},{"$f":"MID(CONTRIBUENTE!$J38,7,1)","v":"6"},{"$f":"MID(CONTRIBUENTE!$J38,8,1)","v":"7"},{"$f":"MID(CONTRIBUENTE!$J38,9,1)","v":"8"},{"$f":"MID(CONTRIBUENTE!$J38,10,1)","v":"9"},null,{"$f":"MID(CONTRIBUENTE!$J38,11,1)","v":"1"},null,{"$f":"MID(CONTRIBUENTE!$J38,12,1)","v":""},{"$f":"MID(CONTRIBUENTE!$J38,13,1)","v":""},{"$f":"MID(CONTRIBUENTE!$J38,14,1)","v":""},{"$f":"MID(CONTRIBUENTE!$J38,15,1)","v":""},{"$f":"MID(CONTRIBUENTE!$J38,16,1)","v":""},null,{"$f":"T54","v":""}]
[]
[null,null,{"$f":"CONTRIBUENTE!E41","v":0},null,null,null,null,null,null,null,null,null,null,null,null,null,null,null,null,null,null,null,null,null,null,null,{"$f":"CONTRIBUENTE!E43","v":0},null,null,null,null,null,null,null,null,null,null,null,{"$f":"MID(TEXT(CONTRIBUENTE!J43,\"gg/mm/aaaa\"),1,1)","v":"0"},{"$f":"MID(TEXT(CONTRIBUENTE!J43,\"gg/mm/aaaa\"),2,1)","v":"0"},null,{"$f":"MID(TEXT(CONTRIBUENTE!J43,\"gg/mm/aaaa\"),4,1)","v":"0"},null,{"$f":"MID(TEXT(CONTRIBUENTE!J43,\"gg/mm/aaaa\"),5,1)","v":"1"},{"$f":"MID(TEXT(CONTRIBUENTE!J43,\"gg/mm/aaaa\"),7,1)","v":"1"},{"$f":"MID(TEXT(CONTRIBUENTE!J43,\"gg/mm/aaaa\"),8,1)","v":"9"},{"$f":"MID(TEXT(CONTRIBUENTE!J43,\"gg/mm/aaaa\"),9,1)","v":"0"},{"$f":"MID(TEXT(CONTRIBUENTE!J43,\"gg/mm/aaaa\"),10,1)","v":"0"}]
[]
[null,null,null,{"$f":"VLOOKUP(CONTRIBUENTE!M43,CONTRIBUENTE!$E$148:$F$149,2,FALSE)","v":{"$error":"#N/A"}},null,null,null,null,null,null,{"$f":"CONTRIBUENTE!D45","v":0},null,null,null,null,null,null,null,null,null,null,null,null,null,null,null,{"$f":"LEFT(CONTRIBUENTE!H45,1)","v":""},{"$f":"RIGHT(CONTRIBUENTE!H45,1)","v":""},null,null,{"$f":"MID(CONTRIBUENTE!$J45,1,1)","v":""},{"$f":"MID(CONTRIBUENTE!$J45,2,1)","v":""},{"$f":"MID(CONTRIBUENTE!$J45,3,1)","v":""},{"$f":"MID(CONTRIBUENTE!$J45,4,1)","v":""},{"$f":"MID(CONTRIBUENTE!$J45,5,1)","v":""},{"$f":"MID(CONTRIBUENTE!$J45,6,1)","v":""},{"$f":"MID(CONTRIBUENTE!$J45,7,1)","v":""},{"$f":"MID(CONTRIBUENTE!$J45,8,1)","v":""},{"$f":"MID(CONTRIBUENTE!$J45,9,1)","v":""},{"$f":"MID(CONTRIBUENTE!$J45,10,1)","v":""},null,{"$f":"MID(CONTRIBUENTE!$J45,11,1)","v":""},null,{"$f":"MID(CONTRIBUENTE!$J45,12,1)","v":""},{"$f":"MID(CONTRIBUENTE!$J45,13,1)","v":""},{"$f":"MID(CONTRIBUENTE!$J45,14,1)","v":""},{"$f":"MID(CONTRIBUENTE!$J45,15,1)","v":""},{"$f":"MID(CONTRIBUENTE!$J45,16,1)","v":""}]
[]
[]
[null,null,{"$f":"MID(VLOOKUP(AX5&\"-\"&AX3,'DATI del VERSAMENTO'!B9:H1008,7,FALSE),1,1)","v":""},null,{"$f":"MID(VLOOKUP(AX5&\"-\"&AX3,'DATI del VERSAMENTO'!B9:H1008,7,FALSE),2,1)","v":""},null,{"$f":"MID(VLOOKUP(AX5&\"-\"&AX3,'DATI del VERSAMENTO'!B9:H1008,7,FALSE),3,1)","v":""},null,null,null,null,null,null,null,null,null,null,null,null,{"$f":"VLOOKUP(AX5&\"-\"&AX3,'DATI del VERSAMENTO'!B9:O1008,14,FALSE)","v":1},null,null,{"$f":"MID(VLOOKUP(AX5&\"-\"&AX3,'DATI del VERSAMENTO'!B9:P1008,15,FALSE),1,1)","v":"I"},{"$f":"MID(VLOOKUP(AX5&\"-\"&AX3,'DATI del VERSAMENTO'!B9:P1008,15,FALSE),2,1)","v":"N"},null,null,{"$f":"MID(VLOOKUP(AX5&\"-\"&AX3,'DATI del VERSAMENTO'!B9:R1008,17,FALSE),1,1)","v":"1"},{"$f":"MID(VLOOKUP(AX5&\"-\"&AX3,'DATI del VERSAMENTO'!B9:R1008,17,FALSE),2,1)","v":"9"},null,{"$f":"MID(VLOOKUP(AX5&\"-\"&AX3,'DATI del VERSAMENTO'!B9:R1008,17,FALSE),3,1)","v":"9"},{"$f":"MID(VLOOKUP(AX5&\"-\"&AX3,'DATI del VERSAMENTO'!B9:R1008,17,FALSE),4,1)","v":"9"},{"$f":"MID(VLOOKUP(AX5&\"-\"&AX3,'DATI del VERSAMENTO'!B9:S1008,18,FALSE),1,1)","v":"1"},{"$f":"MID(VLOOKUP(AX5&\"-\"&AX3,'DATI del VERSAMENTO'!B9:S1008,18,FALSE),2,1)","v":"2"},{"$f":"MID(VLOOKUP(AX5&\"-\"&AX3,'DATI del VERSAMENTO'!B9:S1008,18,FALSE),3,1)","v":"3"},{"$f":"MID(VLOOKUP(AX5&\"-\"&AX3,'DATI del VERSAMENTO'!B9:S1008,18,FALSE),4,1)","v":"4"},{"$f":"MID(VLOOKUP(AX5&\"-\"&AX3,'DATI del VERSAMENTO'!B9:S1008,18,FALSE),5,1)","v":"5"},{"$f":"MID(VLOOKUP(AX5&\"-\"&AX3,'DATI del VERSAMENTO'!B9:S1008,18,FALSE),6,1)","v":"6"},{"$f":"MID(VLOOKUP(AX5&\"-\"&AX3,'DATI del VERSAMENTO'!B9:S1008,18,FALSE),7,1)","v":""},{"$f":"MID(VLOOKUP(AX5&\"-\"&AX3,'DATI del VERSAMENTO'!B9:S1008,18,FALSE),8,1)","v":""},{"$f":"MID(VLOOKUP(AX5&\"-\"&AX3,'DATI del VERSAMENTO'!B9:S1008,18,FALSE),9,1)","v":""},null,{"$f":"MID(VLOOKUP(AX5&\"-\"&AX3,'DATI del VERSAMENTO'!B9:S1008,18,FALSE),10,1)","v":""},null,{"$f":"MID(VLOOKUP(AX5&\"-\"&AX3,'DATI del VERSAMENTO'!B9:S1008,18,FALSE),11,1)","v":""},{"$f":"MID(VLOOKUP(AX5&\"-\"&AX3,'DATI del VERSAMENTO'!B9:S1008,18,FALSE),12,1)","v":""},{"$f":"MID(VLOOKUP(AX5&\"-\"&AX3,'DATI del VERSAMENTO'!B9:S1008,18,FALSE),13,1)","v":""},{"$f":"MID(VLOOKUP(AX5&\"-\"&AX3,'DATI del VERSAMENTO'!B9:S1008,18,FALSE),14,1)","v":""},{"$f":"MID(VLOOKUP(AX5&\"-\"&AX3,'DATI del VERSAMENTO'!B9:S1008,18,FALSE),15,1)","v":""}]
[null,null,null,null,null,null,null,null,null,null,null,null,null,null,null,null,null,null,null,null,null,null,null,null,null,null,null,null,null,null,null,null,null,null,null,null,null,null,null,null,null,null,null,null,null,null,null,null,null,"Note"]
[1,{"$f":"MID(VLOOKUP($AX$5&\"-\"&$AX$3&\"-\"&A24,'DATI del VERSAMENTO'!$C$9:$J$1008,8,FALSE),1,1)","v":"0"},null,{"$f":"MID(VLOOKUP($AX$5&\"-\"&$AX$3&\"-\"&A24,'DATI del VERSAMENTO'!$C$9:$J$1008,8,FALSE),2,1)","v":"0"},null,{"$f":"MID(VLOOKUP($AX$5&\"-\"&$AX$3&\"-\"&A24,'DATI del VERSAMENTO'!$C$9:$J$1008,8,FALSE),3,1)","v":"0"},null,{"$f":"MID(VLOOKUP($AX$5&\"-\"&$AX$3&\"-\"&A24,'DATI del VERSAMENTO'!$C$9:$J$1008,8,FALSE),4,1)","v":"1"},null,null,null,{"$f":"VLOOKUP($AX$5&\"-\"&$AX$3&\"-\"&A24,'DATI del VERSAMENTO'!$C$9:$K$1008,9,FALSE)","v":0},null,null,null,null,null,null,null,null,null,null,null,null,null,null,null,null,null,null,{"$f":"FLOOR(VLOOKUP($AX$5&\"-\"&$AX$3&\"-\"&A24,'DATI del VERSAMENTO'!$C$9:$L$1008,10,FALSE),1)","v":1000},null,null,null,null,null,null,null,{"$f":"LEFT(RIGHT(TEXT(VLOOKUP($AX$5&\"-\"&$AX$3&\"-\"&A24,'DATI del VERSAMENTO'!$C$9:$L$1008,10,FALSE),\"0,00\"),2),1)","v":"0"},null,{"$f":"RIGHT(TEXT(VLOOKUP($AX$5&\"-\"&$AX$3&\"-\"&A24,'DATI del VERSAMENTO'!$C$9:$L$1008,10,FALSE),\"0,00\"),1)","v":"0"},null,null,null,{"$f":"MID(VLOOKUP($AX$5&\"-\"&$AX$3&\"-\"&A24,'DATI del VERSAMENTO'!$C$9:$M$1008,11,FALSE),1,1)","v":"0"},{"$f":"MID(VLOOKUP($AX$5&\"-\"&$AX$3&\"-\"&A24,'DATI del VERSAMENTO'!$C$9:$M$1008,11,FALSE),2,1)","v":"0"},{"$f":"MID(VLOOKUP($AX$5&\"-\"&$AX$3&\"-\"&A24,'DATI del VERSAMENTO'!$C$9:$M$1008,11,FALSE),3,1)","v":"0"},{"$f":"MID(VLOOKUP($AX$5&\"-\"&$AX$3&\"-\"&A24,'DATI del VERSAMENTO'!$C$9:$M$1008,11,FALSE),4,1)","v":"1"},null,{"$f":"VLOOKUP($AX$5&\"-\"&$AX$3&\"-\"&A24,'DATI del VERSAMENTO'!$C$9:$AC$1008,27,FALSE)","v":"Testo Libero"}]
[2,{"$f":"MID(VLOOKUP($AX$5&\"-\"&$AX$3&\"-\"&A25,'DATI del VERSAMENTO'!$C$9:$J$1008,8,FALSE),1,1)","v":{"$error":"#N/A"}},null,{"$f":"MID(VLOOKUP($AX$5&\"-\"&$AX$3&\"-\"&A25,'DATI del VERSAMENTO'!$C$9:$J$1008,8,FALSE),2,1)","v":{"$error":"#N/A"}},null,{"$f":"MID(VLOOKUP($AX$5&\"-\"&$AX$3&\"-\"&A25,'DATI del VERSAMENTO'!$C$9:$J$1008,8,FALSE),3,1)","v":{"$error":"#N/A"}},null,{"$f":"MID(VLOOKUP($AX$5&\"-\"&$AX$3&\"-\"&A25,'DATI del VERSAMENTO'!$C$9:$J$1008,8,FALSE),4,1)","v":{"$error":"#N/A"}},null,null,null,{"$f":"VLOOKUP($AX$5&\"-\"&$AX$3&\"-\"&A25,'DATI del VERSAMENTO'!$C$9:$K$1008,9,FALSE)","v":{"$error":"#N/A"}},null,null,null,null,null,null,null,null,null,null,null,null,null,null,null,null,null,null,{"$f":"FLOOR(VLOOKUP($AX$5&\"-\"&$AX$3&\"-\"&A25,'DATI del VERSAMENTO'!$C$9:$L$1008,10,FALSE),1)","v":{"$error":"#N/A"}},null,null,null,null,null,null,null,{"$f":"LEFT(RIGHT(TEXT(VLOOKUP($AX$5&\"-\"&$AX$3&\"-\"&A25,'DATI del VERSAMENTO'!$C$9:$L$1008,10,FALSE),\"0,00\"),2),1)","v":{"$error":"#N/A"}},null,{"$f":"RIGHT(TEXT(VLOOKUP($AX$5&\"-\"&$AX$3&\"-\"&A25,'DATI del VERSAMENTO'!$C$9:$L$1008,10,FALSE),\"0,00\"),1)","v":{"$error":"#N/A"}},null,null,null,{"$f":"MID(VLOOKUP($AX$5&\"-\"&$AX$3&\"-\"&A25,'DATI del VERSAMENTO'!$C$9:$M$1008,11,FALSE),1,1)","v":{"$error":"#N/A"}},{"$f":"MID(VLOOKUP($AX$5&\"-\"&$AX$3&\"-\"&A25,'DATI del VERSAMENTO'!$C$9:$M$1008,11,FALSE),2,1)","v":{"$error":"#N/A"}},{"$f":"MID(VLOOKUP($AX$5&\"-\"&$AX$3&\"-\"&A25,'DATI del VERSAMENTO'!$C$9:$M$1008,11,FALSE),3,1)","v":{"$error":"#N/A"}},{"$f":"MID(VLOOKUP($AX$5&\"-\"&$AX$3&\"-\"&A25,'DATI del VERSAMENTO'!$C$9:$M$1008,11,FALSE),4,1)","v":{"$error":"#N/A"}},null,{"$f":"VLOOKUP($AX$5&\"-\"&$AX$3&\"-\"&A25,'DATI del VERSAMENTO'!$C$9:$AC$1008,27,FALSE)","v":{"$error":"#N/A"}}]
[3,{"$f":"MID(VLOOKUP($AX$5&\"-\"&$AX$3&\"-\"&A26,'DATI del VERSAMENTO'!$C$9:$J$1008,8,FALSE),1,1)","v":{"$error":"#N/A"}},null,{"$f":"MID(VLOOKUP($AX$5&\"-\"&$AX$3&\"-\"&A26,'DATI del VERSAMENTO'!$C$9:$J$1008,8,FALSE),2,1)","v":{"$error":"#N/A"}},null,{"$f":"MID(VLOOKUP($AX$5&\"-\"&$AX$3&\"-\"&A26,'DATI del VERSAMENTO'!$C$9:$J$1008,8,FALSE),3,1)","v":{"$error":"#N/A"}},null,{"$f":"MID(VLOOKUP($AX$5&\"-\"&$AX$3&\"-\"&A26,'DATI del VERSAMENTO'!$C$9:$J$1008,8,FALSE),4,1)","v":{"$error":"#N/A"}},null,null,null,{"$f":"VLOOKUP($AX$5&\"-\"&$AX$3&\"-\"&A26,'DATI del VERSAMENTO'!$C$9:$K$1008,9,FALSE)","v":{"$error":"#N/A"}},null,null,null,null,null,null,null,null,null,null,null,null,null,null,null,null,null,null,{"$f":"FLOOR(VLOOKUP($AX$5&\"-\"&$AX$3&\"-\"&A26,'DATI del VERSAMENTO'!$C$9:$L$1008,10,FALSE),1)","v":{"$error":"#N/A"}},null,null,null,null,null,null,null,{"$f":"LEFT(RIGHT(TEXT(VLOOKUP($AX$5&\"-\"&$AX$3&\"-\"&A26,'DATI del VERSAMENTO'!$C$9:$L$1008,10,FALSE),\"0,00\"),2),1)","v":{"$error":"#N/A"}},null,{"$f":"RIGHT(TEXT(VLOOKUP($AX$5&\"-\"&$AX$3&\"-\"&A26,'DATI del VERSAMENTO'!$C$9:$L$1008,10,FALSE),\"0,00\"),1)","v":{"$error":"#N/A"}},null,null,null,{"$f":"MID(VLOOKUP($AX$5&\"-\"&$AX$3&\"-\"&A26,'DATI del VERSAMENTO'!$C$9:$M$1008,11,FALSE),1,1)","v":{"$error":"#N/A"}},{"$f":"MID(VLOOKUP($AX$5&\"-\"&$AX$3&\"-\"&A26,'DATI del VERSAMENTO'!$C$9:$M$1008,11,FALSE),2,1)","v":{"$error":"#N/A"}},{"$f":"MID(VLOOKUP($AX$5&\"-\"&$AX$3&\"-\"&A26,'DATI del VERSAMENTO'!$C$9:$M$1008,11,FALSE),3,1)","v":{"$error":"#N/A"}},{"$f":"MID(VLOOKUP($AX$5&\"-\"&$AX$3&\"-\"&A26,'DATI del VERSAMENTO'!$C$9:$M$1008,11,FALSE),4,1)","v":{"$error":"#N/A"}},null,{"$f":"VLOOKUP($AX$5&\"-\"&$AX$3&\"-\"&A26,'DATI del VERSAMENTO'!$C$9:$AC$1008,27,FALSE)","v":{"$error":"#N/A"}}]
[4,{"$f":"MID(VLOOKUP($AX$5&\"-\"&$AX$3&\"-\"&A27,'DATI del VERSAMENTO'!$C$9:$J$1008,8,FALSE),1,1)","v":{"$error":"#N/A"}},null,{"$f":"MID(VLOOKUP($AX$5&\"-\"&$AX$3&\"-\"&A27,'DATI del VERSAMENTO'!$C$9:$J$1008,8,FALSE),2,1)","v":{"$error":"#N/A"}},null,{"$f":"MID(VLOOKUP($AX$5&\"-\"&$AX$3&\"-\"&A27,'DATI del VERSAMENTO'!$C$9:$J$1008,8,FALSE),3,1)","v":{"$error":"#N/A"}},null,{"$f":"MID(VLOOKUP($AX$5&\"-\"&$AX$3&\"-\"&A27,'DATI del VERSAMENTO'!$C$9:$J$1008,8,FALSE),4,1)","v":{"$error":"#N/A"}},null,null,null,{"$f":"VLOOKUP($AX$5&\"-\"&$AX$3&\"-\"&A27,'DATI del VERSAMENTO'!$C$9:$K$1008,9,FALSE)","v":{"$error":"#N/A"}},null,null,null,null,null,null,null,null,null,null,null,null,null,null,null,null,null,null,{"$f":"FLOOR(VLOOKUP($AX$5&\"-\"&$AX$3&\"-\"&A27,'DATI del VERSAMENTO'!$C$9:$L$1008,10,FALSE),1)","v":{"$error":"#N/A"}},null,null,null,null,null,null,null,{"$f":"LEFT(RIGHT(TEXT(VLOOKUP($AX$5&\"-\"&$AX$3&\"-\"&A27,'DATI del VERSAMENTO'!$C$9:$L$1008,10,FALSE),\"0,00\"),2),1)","v":{"$error":"#N/A"}},null,{"$f":"RIGHT(TEXT(VLOOKUP($AX$5&\"-\"&$AX$3&\"-\"&A27,'DATI del VERSAMENTO'!$C$9:$L$1008,10,FALSE),\"0,00\"),1)","v":{"$error":"#N/A"}},null,null,null,{"$f":"MID(VLOOKUP($AX$5&\"-\"&$AX$3&\"-\"&A27,'DATI del VERSAMENTO'!$C$9:$M$1008,11,FALSE),1,1)","v":{"$error":"#N/A"}},{"$f":"MID(VLOOKUP($AX$5&\"-\"&$AX$3&\"-\"&A27,'DATI del VERSAMENTO'!$C$9:$M$1008,11,FALSE),2,1)","v":{"$error":"#N/A"}},{"$f":"MID(VLOOKUP($AX$5&\"-\"&$AX$3&\"-\"&A27,'DATI del VERSAMENTO'!$C$9:$M$1008,11,FALSE),3,1)","v":{"$error":"#N/A"}},{"$f":"MID(VLOOKUP($AX$5&\"-\"&$AX$3&\"-\"&A27,'DATI del VERSAMENTO'!$C$9:$M$1008,11,FALSE),4,1)","v":{"$error":"#N/A"}},null,{"$f":"VLOOKUP($AX$5&\"-\"&$AX$3&\"-\"&A27,'DATI del VERSAMENTO'!$C$9:$AC$1008,27,FALSE)","v":{"$error":"#N/A"}}]
[5,{"$f":"MID(VLOOKUP($AX$5&\"-\"&$AX$3&\"-\"&A28,'DATI del VERSAMENTO'!$C$9:$J$1008,8,FALSE),1,1)","v":{"$error":"#N/A"}},null,{"$f":"MID(VLOOKUP($AX$5&\"-\"&$AX$3&\"-\"&A28,'DATI del VERSAMENTO'!$C$9:$J$1008,8,FALSE),2,1)","v":{"$error":"#N/A"}},null,{"$f":"MID(VLOOKUP($AX$5&\"-\"&$AX$3&\"-\"&A28,'DATI del VERSAMENTO'!$C$9:$J$1008,8,FALSE),3,1)","v":{"$error":"#N/A"}},null,{"$f":"MID(VLOOKUP($AX$5&\"-\"&$AX$3&\"-\"&A28,'DATI del VERSAMENTO'!$C$9:$J$1008,8,FALSE),4,1)","v":{"$error":"#N/A"}},null,null,null,{"$f":"VLOOKUP($AX$5&\"-\"&$AX$3&\"-\"&A28,'DATI del VERSAMENTO'!$C$9:$K$1008,9,FALSE)","v":{"$error":"#N/A"}},null,null,null,null,null,null,null,null,null,null,null,null,null,null,null,null,null,null,{"$f":"FLOOR(VLOOKUP($AX$5&\"-\"&$AX$3&\"-\"&A28,'DATI del VERSAMENTO'!$C$9:$L$1008,10,FALSE),1)","v":{"$error":"#N/A"}},null,null,null,null,null,null,null,{"$f":"LEFT(RIGHT(TEXT(VLOOKUP($AX$5&\"-\"&$AX$3&\"-\"&A28,'DATI del VERSAMENTO'!$C$9:$L$1008,10,FALSE),\"0,00\"),2),1)","v":{"$error":"#N/A"}},null,{"$f":"RIGHT(TEXT(VLOOKUP($AX$5&\"-\"&$AX$3&\"-\"&A28,'DATI del VERSAMENTO'!$C$9:$L$1008,10,FALSE),\"0,00\"),1)","v":{"$error":"#N/A"}},null,null,null,{"$f":"MID(VLOOKUP($AX$5&\"-\"&$AX$3&\"-\"&A28,'DATI del VERSAMENTO'!$C$9:$M$1008,11,FALSE),1,1)","v":{"$error":"#N/A"}},{"$f":"MID(VLOOKUP($AX$5&\"-\"&$AX$3&\"-\"&A28,'DATI del VERSAMENTO'!$C$9:$M$1008,11,FALSE),2,1)","v":{"$error":"#N/A"}},{"$f":"MID(VLOOKUP($AX$5&\"-\"&$AX$3&\"-\"&A28,'DATI del VERSAMENTO'!$C$9:$M$1008,11,FALSE),3,1)","v":{"$error":"#N/A"}},{"$f":"MID(VLOOKUP($AX$5&\"-\"&$AX$3&\"-\"&A28,'DATI del VERSAMENTO'!$C$9:$M$1008,11,FALSE),4,1)","v":{"$error":"#N/A"}},null,{"$f":"VLOOKUP($AX$5&\"-\"&$AX$3&\"-\"&A28,'DATI del VERSAMENTO'!$C$9:$AC$1008,27,FALSE)","v":{"$error":"#N/A"}}]
[6,{"$f":"MID(VLOOKUP($AX$5&\"-\"&$AX$3&\"-\"&A29,'DATI del VERSAMENTO'!$C$9:$J$1008,8,FALSE),1,1)","v":{"$error":"#N/A"}},null,{"$f":"MID(VLOOKUP($AX$5&\"-\"&$AX$3&\"-\"&A29,'DATI del VERSAMENTO'!$C$9:$J$1008,8,FALSE),2,1)","v":{"$error":"#N/A"}},null,{"$f":"MID(VLOOKUP($AX$5&\"-\"&$AX$3&\"-\"&A29,'DATI del VERSAMENTO'!$C$9:$J$1008,8,FALSE),3,1)","v":{"$error":"#N/A"}},null,{"$f":"MID(VLOOKUP($AX$5&\"-\"&$AX$3&\"-\"&A29,'DATI del VERSAMENTO'!$C$9:$J$1008,8,FALSE),4,1)","v":{"$error":"#N/A"}},null,null,null,{"$f":"VLOOKUP($AX$5&\"-\"&$AX$3&\"-\"&A29,'DATI del VERSAMENTO'!$C$9:$K$1008,9,FALSE)","v":{"$error":"#N/A"}},null,null,null,null,null,null,null,null,null,null,null,null,null,null,null,null,null,null,{"$f":"FLOOR(VLOOKUP($AX$5&\"-\"&$AX$3&\"-\"&A29,'DATI del VERSAMENTO'!$C$9:$L$1008,10,FALSE),1)","v":{"$error":"#N/A"}},null,null,null,null,null,null,null,{"$f":"LEFT(RIGHT(TEXT(VLOOKUP($AX$5&\"-\"&$AX$3&\"-\"&A29,'DATI del VERSAMENTO'!$C$9:$L$1008,10,FALSE),\"0,00\"),2),1)","v":{"$error":"#N/A"}},null,{"$f":"RIGHT(TEXT(VLOOKUP($AX$5&\"-\"&$AX$3&\"-\"&A29,'DATI del VERSAMENTO'!$C$9:$L$1008,10,FALSE),\"0,00\"),1)","v":{"$error":"#N/A"}},null,null,null,{"$f":"MID(VLOOKUP($AX$5&\"-\"&$AX$3&\"-\"&A29,'DATI del VERSAMENTO'!$C$9:$M$1008,11,FALSE),1,1)","v":{"$error":"#N/A"}},{"$f":"MID(VLOOKUP($AX$5&\"-\"&$AX$3&\"-\"&A29,'DATI del VERSAMENTO'!$C$9:$M$1008,11,FALSE),2,1)","v":{"$error":"#N/A"}},{"$f":"MID(VLOOKUP($AX$5&\"-\"&$AX$3&\"-\"&A29,'DATI del VERSAMENTO'!$C$9:$M$1008,11,FALSE),3,1)","v":{"$error":"#N/A"}},{"$f":"MID(VLOOKUP($AX$5&\"-\"&$AX$3&\"-\"&A29,'DATI del VERSAMENTO'!$C$9:$M$1008,11,FALSE),4,1)","v":{"$error":"#N/A"}},null,{"$f":"VLOOKUP($AX$5&\"-\"&$AX$3&\"-\"&A29,'DATI del VERSAMENTO'!$C$9:$AC$1008,27,FALSE)","v":{"$error":"#N/A"}}]
[7,{"$f":"MID(VLOOKUP($AX$5&\"-\"&$AX$3&\"-\"&A30,'DATI del VERSAMENTO'!$C$9:$J$1008,8,FALSE),1,1)","v":{"$error":"#N/A"}},null,{"$f":"MID(VLOOKUP($AX$5&\"-\"&$AX$3&\"-\"&A30,'DATI del VERSAMENTO'!$C$9:$J$1008,8,FALSE),2,1)","v":{"$error":"#N/A"}},null,{"$f":"MID(VLOOKUP($AX$5&\"-\"&$AX$3&\"-\"&A30,'DATI del VERSAMENTO'!$C$9:$J$1008,8,FALSE),3,1)","v":{"$error":"#N/A"}},null,{"$f":"MID(VLOOKUP($AX$5&\"-\"&$AX$3&\"-\"&A30,'DATI del VERSAMENTO'!$C$9:$J$1008,8,FALSE),4,1)","v":{"$error":"#N/A"}},null,null,null,{"$f":"VLOOKUP($AX$5&\"-\"&$AX$3&\"-\"&A30,'DATI del VERSAMENTO'!$C$9:$K$1008,9,FALSE)","v":{"$error":"#N/A"}},null,null,null,null,null,null,null,null,null,null,null,null,null,null,null,null,null,null,{"$f":"FLOOR(VLOOKUP($AX$5&\"-\"&$AX$3&\"-\"&A30,'DATI del VERSAMENTO'!$C$9:$L$1008,10,FALSE),1)","v":{"$error":"#N/A"}},null,null,null,null,null,null,null,{"$f":"LEFT(RIGHT(TEXT(VLOOKUP($AX$5&\"-\"&$AX$3&\"-\"&A30,'DATI del VERSAMENTO'!$C$9:$L$1008,10,FALSE),\"0,00\"),2),1)","v":{"$error":"#N/A"}},null,{"$f":"RIGHT(TEXT(VLOOKUP($AX$5&\"-\"&$AX$3&\"-\"&A30,'DATI del VERSAMENTO'!$C$9:$L$1008,10,FALSE),\"0,00\"),1)","v":{"$error":"#N/A"}},null,null,null,{"$f":"MID(VLOOKUP($AX$5&\"-\"&$AX$3&\"-\"&A30,'DATI del VERSAMENTO'!$C$9:$M$1008,11,FALSE),1,1)","v":{"$error":"#N/A"}},{"$f":"MID(VLOOKUP($AX$5&\"-\"&$AX$3&\"-\"&A30,'DATI del VERSAMENTO'!$C$9:$M$1008,11,FALSE),2,1)","v":{"$error":"#N/A"}},{"$f":"MID(VLOOKUP($AX$5&\"-\"&$AX$3&\"-\"&A30,'DATI del VERSAMENTO'!$C$9:$M$1008,11,FALSE),3,1)","v":{"$error":"#N/A"}},{"$f":"MID(VLOOKUP($AX$5&\"-\"&$AX$3&\"-\"&A30,'DATI del VERSAMENTO'!$C$9:$M$1008,11,FALSE),4,1)","v":{"$error":"#N/A"}},null,{"$f":"VLOOKUP($AX$5&\"-\"&$AX$3&\"-\"&A30,'DATI del VERSAMENTO'!$C$9:$AC$1008,27,FALSE)","v":{"$error":"#N/A"}}]
[8,{"$f":"MID(VLOOKUP($AX$5&\"-\"&$AX$3&\"-\"&A31,'DATI del VERSAMENTO'!$C$9:$J$1008,8,FALSE),1,1)","v":{"$error":"#N/A"}},null,{"$f":"MID(VLOOKUP($AX$5&\"-\"&$AX$3&\"-\"&A31,'DATI del VERSAMENTO'!$C$9:$J$1008,8,FALSE),2,1)","v":{"$error":"#N/A"}},null,{"$f":"MID(VLOOKUP($AX$5&\"-\"&$AX$3&\"-\"&A31,'DATI del VERSAMENTO'!$C$9:$J$1008,8,FALSE),3,1)","v":{"$error":"#N/A"}},null,{"$f":"MID(VLOOKUP($AX$5&\"-\"&$AX$3&\"-\"&A31,'DATI del VERSAMENTO'!$C$9:$J$1008,8,FALSE),4,1)","v":{"$error":"#N/A"}},null,null,null,{"$f":"VLOOKUP($AX$5&\"-\"&$AX$3&\"-\"&A31,'DATI del VERSAMENTO'!$C$9:$K$1008,9,FALSE)","v":{"$error":"#N/A"}},null,null,null,null,null,null,null,null,null,null,null,null,null,null,null,null,null,null,{"$f":"FLOOR(VLOOKUP($AX$5&\"-\"&$AX$3&\"-\"&A31,'DATI del VERSAMENTO'!$C$9:$L$1008,10,FALSE),1)","v":{"$error":"#N/A"}},null,null,null,null,null,null,null,{"$f":"LEFT(RIGHT(TEXT(VLOOKUP($AX$5&\"-\"&$AX$3&\"-\"&A31,'DATI del VERSAMENTO'!$C$9:$L$1008,10,FALSE),\"0,00\"),2),1)","v":{"$error":"#N/A"}},null,{"$f":"RIGHT(TEXT(VLOOKUP($AX$5&\"-\"&$AX$3&\"-\"&A31,'DATI del VERSAMENTO'!$C$9:$L$1008,10,FALSE),\"0,00\"),1)","v":{"$error":"#N/A"}},null,null,null,{"$f":"MID(VLOOKUP($AX$5&\"-\"&$AX$3&\"-\"&A31,'DATI del VERSAMENTO'!$C$9:$M$1008,11,FALSE),1,1)","v":{"$error":"#N/A"}},{"$f":"MID(VLOOKUP($AX$5&\"-\"&$AX$3&\"-\"&A31,'DATI del VERSAMENTO'!$C$9:$M$1008,11,FALSE),2,1)","v":{"$error":"#N/A"}},{"$f":"MID(VLOOKUP($AX$5&\"-\"&$AX$3&\"-\"&A31,'DATI del VERSAMENTO'!$C$9:$M$1008,11,FALSE),3,1)","v":{"$error":"#N/A"}},{"$f":"MID(VLOOKUP($AX$5&\"-\"&$AX$3&\"-\"&A31,'DATI del VERSAMENTO'!$C$9:$M$1008,11,FALSE),4,1)","v":{"$error":"#N/A"}},null,{"$f":"VLOOKUP($AX$5&\"-\"&$AX$3&\"-\"&A31,'DATI del VERSAMENTO'!$C$9:$AC$1008,27,FALSE)","v":{"$error":"#N/A"}}]
[null,null,null,null,null,null,null,null,null,null,null,null,null,null,null,null,null,null,null,null,null,null,null,null,null,null,null,null,null,null,{"$f":"FLOOR(SUMIF('DATI del VERSAMENTO'!B9:B1008,$AX$5&\"-\"&$AX$3,'DATI del VERSAMENTO'!L9:L1008),1)","v":1000},null,null,null,null,null,null,null,{"$f":"LEFT(RIGHT(TEXT(SUMIF('DATI del VERSAMENTO'!B9:B1008,$AX$5&\"-\"&$AX$3,'DATI del VERSAMENTO'!L9:L1008),\"0,00\"),2),1)","v":"0"},null,{"$f":"RIGHT(TEXT(SUMIF('DATI del VERSAMENTO'!B9:B1008,$AX$5&\"-\"&$AX$3,'DATI del VERSAMENTO'!L9:L1008),\"0,00\"),1)","v":"0"}]
[]
[]
[]
[]
[null,{"$f":"MID(TEXT(VLOOKUP(AX5&\"-\"&AX3,'DATI del VERSAMENTO'!B9:E1008,4,FALSE),\"gg/mm/aaaa\"),1,1)","v":"0"},null,{"$f":"MID(TEXT(VLOOKUP(AX5&\"-\"&AX3,'DATI del VERSAMENTO'!B9:E1008,4,FALSE),\"gg/mm/aaaa\"),2,1)","v":"1"},null,{"$f":"MID(TEXT(VLOOKUP(AX5&\"-\"&AX3,'DATI del VERSAMENTO'!B9:E1008,4,FALSE),\"gg/mm/aaaa\"),4,1)","v":"0"},null,{"$f":"MID(TEXT(VLOOKUP(AX5&\"-\"&AX3,'DATI del VERSAMENTO'!B9:E1008,4,FALSE),\"gg/mm/aaaa\"),5,1)","v":"1"},null,{"$f":"MID(TEXT(VLOOKUP(AX5&\"-\"&AX3,'DATI del VERSAMENTO'!B9:E1008,4,FALSE),\"gg/mm/aaaa\"),7,1)","v":"2"},{"$f":"MID(TEXT(VLOOKUP(AX5&\"-\"&AX3,'DATI del VERSAMENTO'!B9:E1008,4,FALSE),\"gg/mm/aaaa\"),8,1)","v":"0"},null,{"$f":"MID(TEXT(VLOOKUP(AX5&\"-\"&AX3,'DATI del VERSAMENTO'!B9:E1008,4,FALSE),\"gg/mm/aaaa\"),9,1)","v":"2"},{"$f":"MID(TEXT(VLOOKUP(AX5&\"-\"&AX3,'DATI del VERSAMENTO'!B9:E1008,4,FALSE),\"gg/mm/aaaa\"),10,1)","v":"4"},{"$f":"VLOOKUP(VLOOKUP(AX5&\"-\"&AX3,'DATI del VERSAMENTO'!B9:U1008,20,FALSE),Tabelle!B4:O6,14,FALSE)","v":"00001"},null,null,null,null,null,null,{"$f":"VLOOKUP(VLOOKUP(AX5&\"-\"&AX3,'DATI del VERSAMENTO'!B9:U1008,20,FALSE),Tabelle!B4:Q6,16,FALSE)","v":"10000"}]
[]
[]
[null,null,null,null,{"$f":"CONCATENATE(\"nr. IBAN:  \",VLOOKUP(VLOOKUP(AX5&\"-\"&AX3,'DATI del VERSAMENTO'!B9:Y1008,24,FALSE),Tabelle!B4:S6,18,FALSE))","v":"nr. IBAN:  IT12 A 12345 12345 123456789012"}]
[null,null,null,null,null,null,null,null,null,null,null,null,null,null,null,null,null,null,null,null,null,null,null,null,null,null,null,null,null,null,null,null,null,null,null,null,null,null,null,null,null,null,null,null,null,null,null,null,null,{"$f":"AX5","v":1}]
[]
[null,"Oscura"]
[null,null,null,null,null,null,"ESTREMI VERSAMENTO",null,null,null,null,null,null,null,null,null,null,null,null,null,null,null,null,null,null,null,null,null,null,null,null,null,null,null,null,null,null,null,null,null,null,null,null,null,null,null,null,{"$f":"CONTRIBUENTE!$G$13","v":""}]
[null,null,null,null,null,null,"INTESTAZIONE"]
[null,null,null,null,null,null,"AREA DESCRIZIONE"]
[null,null,null,null,null,null,"IBAN"]
[]
[]
[]
[]
[null,null,null,null,null,null,null,null,null,null,null,null,{"$f":"IF(B44=$F$53,TRUE,FALSE)","v":false},null,null,null,null,null,null,null,null,null,null,null,null,null,null,null,null,null,null,null,null,null,null,null,null,{"$f":"CONTRIBUENTE!J36","v":"2000-01-01"},null,null,null,null,null,{"$f":"VLOOKUP(AX5&\"-\"&AX3,'DATI del VERSAMENTO'!B9:E1008,4,FALSE)","v":"2024-01-01"}]
[null,null,null,null,null,"Oscura",null,null,null,null,null,null,{"$f":"IF(B45=$F$53,TRUE,FALSE)","v":false},null,null,null,null,null,null,null,null,null,null,null,null,null,null,null,null,null,null,null,null,null,null,null,null,{"$f":"CONTRIBUENTE!J43","v":"00:00:00"}]
[null,null,null,null,null,null,null,null,null,null,null,null,{"$f":"IF(B46=$F$53,TRUE,FALSE)","v":false},null,null,null,null,null,null,{"$f":"IF(ISERROR(AV55),\"File danneggiato\",IF(AF55=0,\"File scaduto\",\"\"))","v":""},null,null,null,null,null,null,null,null,null,null,null,"File scaduto / INVERTITO",null,null,null,null,null,null,null,null,null,null,null,"BIT INTEGRITA'",null,null,null,"Integrità"]
[null,null,null,null,null,null,null,null,null,null,null,null,{"$f":"IF(B47=$F$53,TRUE,FALSE)","v":false},null,null,null,null,null,null,null,null,null,null,null,null,null,null,null,null,null,null,{"$f":"IF(CONTRIBUENTE!$H$138=1,0,1)","v":1},null,null,null,null,null,null,null,null,null,null,null,1,null,null,null,{"$f":"CONTRIBUENTE!K138","v":4}]

{"sheet":"Tabelle","index":3,"n_rows":87,"n_cols":21,"rows_kept":87,"cut":false,"hidden":false,"merged":[[81,16,81,19],[77,16,77,19],[78,16,78,19],[79,16,79,19],[30,1,30,12],[30,16,30,20],[31,16,31,20],[76,16,76,19],[72,16,72,19],[73,16,73,19],[70,16,70,19],[71,16,71,19],[64,16,64,19],[80,16,80,19],[65,16,65,19],[66,16,66,19],[67,16,67,19],[74,16,74,19],[75,16,75,19],[68,16,68,19],[69,16,69,19],[60,16,60,19],[61,16,61,19],[62,16,62,19],[63,16,63,19],[56,16,56,19],[57,16,57,19],[58,16,58,19],[59,16,59,19],[41,16,41,19],[42,16,42,19],[43,16,43,19],[52,16,52,19],[53,16,53,19],[54,16,54,19],[55,16,55,19],[48,16,48,19],[49,16,49,19],[50,16,50,19],[51,16,51,19],[71,1,71,12],[11,1,11,20],[80,1,80,12],[81,1,81,12],[31,13,31,14],[31,1,31,12],[76,1,76,12],[77,1,77,12],[78,1,78,12],[79,1,79,12],[72,1,72,12],[36,16,36,19],[37,16,37,19],[38,16,38,19],[39,16,39,19],[32,16,32,19],[33,16,33,19],[34,16,34,19],[35,16,35,19],[44,16,44,19],[45,16,45,19],[46,16,46,19],[47,16,47,19],[40,16,40,19],[80,13,80,14],[81,13,81,14],[52,1,52,12],[53,1,53,12],[54,1,54,12],[55,1,55,12],[56,1,56,12],[57,1,57,12],[58,1,58,12],[59,1,59,12],[64,1,64,12],[65,1,65,12],[66,1,66,12],[67,1,67,12],[60,1,60,12],[61,1,61,12],[62,1,62,12],[63,1,63,12],[73,1,73,12],[74,1,74,12],[75,1,75,12],[68,1,68,12],[69,1,69,12],[70,1,70,12],[71,13,71,14],[64,13,64,14],[65,13,65,14],[66,13,66,14],[67,13,67,14],[76,13,76,14],[77,13,77,14],[78,13,78,14],[79,13,79,14],[72,13,72,14],[73,13,73,14],[74,13,74,14],[75,13,75,14],[62,13,62,14],[63,13,63,14],[56,13,56,14],[57,13,57,14],[58,13,58,14],[59,13,59,14],[68,13,68,14],[69,13,69,14],[70,13,70,14],[53,13,53,14],[54,13,54,14],[55,13,55,14],[48,13,48,14],[49,13,49,14],[50,13,50,14],[51,13,51,14],[60,13,60,14],[61,13,61,14],[44,13,44,14],[45,13,45,14],[46,13,46,14],[47,13,47,14],[40,13,40,14],[41,13,41,14],[42,13,42,14],[43,13,43,14],[52,13,52,14],[48,1,48,12],[49,1,49,12],[50,1,50,12],[51,1,51,12],[44,1,44,12],[45,1,45,12],[46,1,46,12],[47,1,47,12],[36,1,36,12],[37,1,37,12],[38,1,38,12],[39,1,39,12],[17,8,17,9],[18,8,18,9],[40,1,40,12],[41,1,41,12],[42,1,42,12],[43,1,43,12],[12,10,12,19],[27,8,27,9],[27,10,27,19],[28,8,28,9],[28,10,28,19],[25,8,25,9],[32,1,32,12],[33,1,33,12],[34,1,34,12],[35,1,35,12],[36,13,36,14],[37,13,37,14],[38,13,38,14],[39,13,39,14],[32,13,32,14],[33,13,33,14],[34,13,34,14],[35,13,35,14],[25,10,25,19],[26,10,26,19],[19,10,19,19],[20,10,20,19],[21,10,21,19],[22,10,22,19],[26,8,26,9],[23,8,23,9],[24,8,24,9],[19,8,19,9],[15,1,15,5],[12,8,12,9],[13,8,13,9],[14,8,14,9],[15,8,15,9],[12,1,12,6],[13,1,13,5],[23,10,23,19],[24,10,24,19],[21,8,21,9],[22,8,22,9],[16,1,16,5],[17,1,17,5],[18,1,18,5],[19,1,19,5],[20,8,20,9],[14,1,14,5],[14,10,14,19],[13,10,13,19],[15,10,15,19],[16,10,16,19],[17,10,17,19],[18,10,18,19],[16,8,16,9],[5,8,5,12],[7,18,7,22],[7,15,7,17],[5,16,5,17],[5,18,5,22],[3,18,3,22],[4,18,4,22],[3,14,3,15],[2,2,2,7],[2,8,2,12],[2,14,2,15],[2,16,2,17],[5,14,5,15],[4,16,4,17],[3,16,3,17],[5,2,5,7],[3,8,3,12],[4,8,4,12],[4,14,4,15],[3,2,3,7],[4,2,4,7]]}
[]
[]
[null,"SIGLA","Delega irrevocabile a",null,null,null,null,null,"Agenzia",null,null,null,null,"Prov.","ABI",null,"CAB",null,"IBAN"]
[null,"B1","Nome Banca 1 / modifica sigla",null,null,null,null,null,"Nome Agenzia 1",null,null,null,null,"XX","00001",null,"10000",null,"IT12 A 12345 12345 123456789012"]
[null,"B2","Nome Banca 2 / modifica sigla",null,null,null,null,null,"Nome Agenzia 2",null,null,null,null,"XX","00002",null,"20000"]
[null,"B3","Nome Banca 3 / modifica sigla",null,null,null,null,null,"Nome Agenzia 3",null,null,null,null,"XX","00003",null,"30000"]
[]
[null,null,"Personalizza tutti i campi liberi.",null,null,null,null,null,null,null,null,null,null,null,null,"Sequenza IBAN:",null,null,"IT12 A 12345 12345 123456789012 = 31 carat."]
[]
[]
[]
[null,"Tabella CONTENZIOSO"]
[null,"Descrizione",null,null,null,null,null,null,"Ufficio",null,"CAUSALE",null,null,null,null,null,null,null,null,null,"COD."]
[null,"Commiss. tributaria prov.le",null,null,null,null,1,null,"ENTRATE",null,"IVA per acquisti intracomunitari (art.49 L.513/92)",null,null,null,null,null,null,null,null,null,"IN"]
[null,"Commiss. tributaria reg.le",null,null,null,null,2,null,"ENTRATE",null,"IVA per acquisti intra.i di mezzi di trasporto nuovi (art. 38 L.513/92)",null,null,null,null,null,null,null,null,null,"VT"]
[null,"Commiss. tributaria centrale",null,null,null,null,3,null,"ENTRATE",null,"Registrazione di atti giudiziari",null,null,null,null,null,null,null,null,null,"RG"]
[null,"Corte d’ Appello",null,null,null,null,4,null,"ENTRATE",null,"Registrazione di atti pubblici o privati",null,null,null,null,null,null,null,null,null,"RP"]
[null,"Corte di Cassazione",null,null,null,null,5,null,"ENTRATE",null,"Sanzioni pecuniarie in materia di imposte dirette ed indirette",null,null,null,null,null,null,null,null,null,"SZ"]
[null,"Conciliazione giudiziale",null,null,null,null,6,null,"ENTRATE",null,"Tributi autoliquidati collegati alla successione",null,null,null,null,null,null,null,null,null,"SA"]
[null,"---- Inserisci",null,null,null,null,".",null,"Territorio",null,"Certificazione ipotecaria",null,null,null,null,null,null,null,null,null,"CR"]
[null,null,null,null,null,null,null,null,"Territorio",null,"Depositi per rilascio certificati",null,null,null,null,null,null,null,null,null,"DR"]
[null,null,null,null,null,null,null,null,"Territorio",null,"Ispezione ipotecaria",null,null,null,null,null,null,null,null,null,"IR"]
[null,null,null,null,null,null,null,null,"Territorio",null,"Entrate demaniali",null,null,null,null,null,null,null,null,null,"ED"]
[null,null,null,null,null,null,null,null,"Territorio",null,"Entrate patrimoniali",null,null,null,null,null,null,null,null,null,"EP"]
[null,null,null,null,null,null,null,null,"Territorio",null,"Formalità ipotecaria",null,null,null,null,null,null,null,null,null,"TR"]
[null,null,null,null,null,null,null,null,"Territorio",null,"Somme accertate Conservatorie",null,null,null,null,null,null,null,null,null,"MR"]
[null,null,null,null,null,null,null,null,"ALTRI Enti",null,"Processi verbali/ordini di pagamento emessi da altri enti",null,null,null,null,null,null,null,null,null,"PA"]
[null,null,null,null,null,null,null,null,null,null,"---- Inserisci",null,null,null,null,null,null,null,null,null,".."]
[null,null,null,null,null,null,null,null,null,null,"---- Inserisci",null,null,null,null,null,null,null,null,null,".."]
[]
[null,"Tabella CODICI TRIBUTO",null,null,null,null,null,null,null,null,null,null,null,null,null,null,"CONCESSIONARIO"]
[null,"Descrizione dei pagamenti (principali)",null,null,null,null,null,null,null,null,null,null,null,"COD.",null,null,"DI"]
[null,"Imposta catastale",null,null,null,null,null,null,null,null,null,null,null,"737T",null,null,"Inserisci Provincia",null,null,null,"PV"]
[null,"Imposta di bollo - tassa sui contratti di borsa",null,null,null,null,null,null,null,null,null,null,null,"456T",null,null,"MILANO",null,null,null,"MI"]
[null,"Imposta di bollo su libri e registri - All. A, parte I, Art. 16, DPR 642/72",null,null,null,null,null,null,null,null,null,null,null,"458T",null,null,"R O M A",null,null,null,"RO"]
[null,"Imposta ipotecaria",null,null,null,null,null,null,null,null,null,null,null,"649T",null,null,"PALERMO",null,null,null,"PA"]
[null,"Imposta registro per affitto fondi rustici",null,null,null,null,null,null,null,null,null,null,null,"108T",null,null,null,null,null,null," "]
[null,"Imposta registro per atti, contratti verbali e denunce",null,null,null,null,null,null,null,null,null,null,null,"109T",null,null,null,null,null,null," "]
[null,"Imposta registro per cessioni (contratti di locazione e affitti)",null,null,null,null,null,null,null,null,null,null,null,"110T",null,null,null,null,null,null," "]
[null,"Imposta registro per contratti di locazione fabbricati - prima annualità",null,null,null,null,null,null,null,null,null,null,null,"115T",null,null,null,null,null,null," "]
[null,"Imposta registro per contratti di locazione fabbricati - annualità successive",null,null,null,null,null,null,null,null,null,null,null,"112T",null,null,null,null,null,null," "]
[null,"Imposta registro per contratti di locazione fabbricati - intero periodo",null,null,null,null,null,null,null,null,null,null,null,"107T",null,null,null,null,null,null," "]
[null,"Imposta registro per proroghe (contratti di locazione e affitti)",null,null,null,null,null,null,null,null,null,null,null,"114T",null,null,null,null,null,null," "]
[null,"Imposta registro per risoluzioni (contratti di locazione e affitti)",null,null,null,null,null,null,null,null,null,null,null,"113T",null,null,null,null,null,null," "]
[null,"Imposta registro trasferimento fabbricati e relativi contratti preliminari",null,null,null,null,null,null,null,null,null,null,null,"104T",null,null,null,null,null,null," "]
[null,"Imposta registro trasferimento terreni e relativi contratti preliminari",null,null,null,null,null,null,null,null,null,null,null,"105T",null,null,null,null,null,null," "]
[null,"Imposta sostitutiva delle imposte di registro",null,null,null,null,null,null,null,null,null,null,null,"460T",null,null,null,null,null,null," "]
[null,"Imposta sostitutiva INVIM L. 140/97 - Successioni",null,null,null,null,null,null,null,null,null,null,null,"722T",null,null,null,null,null,null," "]
[null,"Imposta sul valore aggiunto - scambi interni",null,null,null,null,null,null,null,null,null,null,null,"100T",null,null,null,null,null,null," "]
[null,"Imposta sulle assicurazioni - aumento aliquota - Erario",null,null,null,null,null,null,null,null,null,null,null,"528T",null,null,null,null,null,null," "]
[null,"Imposta sulle assicurazioni - Erario",null,null,null,null,null,null,null,null,null,null,null,"527T",null,null,null,null,null,null," "]
[null,"Imposta sulle assicurazioni derivanti da R.C. Auto - Province",null,null,null,null,null,null,null,null,null,null,null,"529T",null,null,null,null,null,null," "]
[null,"Imposta sulle donazioni",null,null,null,null,null,null,null,null,null,null,null,"005T",null,null,null,null,null,null," "]
[null,"Tassa ipotecaria",null,null,null,null,null,null,null,null,null,null,null,"778T",null,null,null,null,null,null," "]
[null,"Tassa istruzione superiore (laurea e abilitazione professionale)",null,null,null,null,null,null,null,null,null,null,null,"729T",null,null,null,null,null,null," "]
[null,"Sanzione pecuniaria abbonamenti alle radioaudizioni",null,null,null,null,null,null,null,null,null,null,null,"680T",null,null,null,null,null,null," "]
[null,"Sanzione pecuniaria imposta di bollo",null,null,null,null,null,null,null,null,null,null,null,"675T",null,null,null,null,null,null," "]
[null,"Sanzione pecuniaria imposta di registro",null,null,null,null,null,null,null,null,null,null,null,"671T",null,null,null,null,null,null," "]
[null,"Sanzione pecuniaria imposta sugli spettacoli",null,null,null,null,null,null,null,null,null,null,null,"677T",null,null,null,null,null,null," "]
[null,"Sanzione pecuniaria imposta sull’ INVIM",null,null,null,null,null,null,null,null,null,null,null,"673T",null,null,null,null,null,null," "]
[null,"Sanzione pecuniaria imposta sulle assicurazioni private e contratti vitalizi",null,null,null,null,null,null,null,null,null,null,null,"676T",null,null,null,null,null,null," "]
[null,"Sanzione pecuniaria imposte e tasse ipotecarie e catastali",null,null,null,null,null,null,null,null,null,null,null,"674T",null,null,null,null,null,null," "]
[null,"Sanzione pecuniaria imposte sulle successioni e donazioni",null,null,null,null,null,null,null,null,null,null,null,"672T",null,null,null,null,null,null," "]
[null,"Sanzione pecuniaria in materia di abbonamento televisione",null,null,null,null,null,null,null,null,null,null,null,"681T",null,null,null,null,null,null," "]
[null,"Sanzione pecuniaria tasse sul possesso di autoveicoli",null,null,null,null,null,null,null,null,null,null,null,"679T",null,null,null,null,null,null," "]
[null,"Sanzione pecuniaria tasse sulle Concessioni Governative",null,null,null,null,null,null,null,null,null,null,null,"678T",null,null,null,null,null,null," "]
[null,"Sanzioni ammin.-multe inflitte dalle autorità giudiz. e ammin.",null,null,null,null,null,null,null,null,null,null,null,"741T",null,null,null,null,null,null," "]
[null,"Sanzioni pecuniarie per altri tributi indiretti",null,null,null,null,null,null,null,null,null,null,null,"682T",null,null,null,null,null,null," "]
[null,"Sanzioni pecuniarie in materia di abbonamento alla televisione",null,null,null,null,null,null,null,null,null,null,null,"681T",null,null,null,null,null,null," "]
[null,"Concessione beni del demanio pubblico artistico storico",null,null,null,null,null,null,null,null,null,null,null,"834T",null,null,null,null,null,null," "]
[null,"Concessioni di spiagge lacuali",null,null,null,null,null,null,null,null,null,null,null,"832T",null,null,null,null,null,null," "]
[null,"Proventi dei beni del demanio marittimo",null,null,null,null,null,null,null,null,null,null,null,"842T",null,null,null,null,null,null," "]
[null,"Contributo unificato di iscrizione al ruolo nei procedimenti",null,null,null,null,null,null,null,null,null,null,null,"941T",null,null,null,null,null,null," "]
[null,"Proventi dei beni del demanio militare",null,null,null,null,null,null,null,null,null,null,null,"840T",null,null,null,null,null,null," "]
[null,"Proventi delle utilizzazioni delle acque pubbliche",null,null,null,null,null,null,null,null,null,null,null,"825T",null,null,null,null,null,null," "]
[null,"Redditi di beni immobili patrimoniali",null,null,null,null,null,null,null,null,null,null,null,"811T",null,null,null,null,null,null," "]
[null,"Contributo unificato di iscrizione al ruolo nei procedimenti giurisdizionali",null,null,null,null,null,null,null,null,null,null,null,"941T",null,null,null,null,null,null," "]
[null,"---- Inserisci",null,null,null,null,null,null,null,null,null,null,null,"....",null,null,null,null,null,null," "]
[null,"---- Inserisci",null,null,null,null,null,null,null,null,null,null,null,"....",null,null,null,null,null,null," "]
[null,"---- Inserisci",null,null,null,null,null,null,null,null,null,null,null,"....",null,null,null,null,null,null," "]
[null,"---- Inserisci",null,null,null,null,null,null,null,null,null,null,null,"....",null,null,null,null,null,null," "]
[null,"---- Inserisci",null,null,null,null,null,null,null,null,null,null,null,"....",null,null,null,null,null,null,"."]
[]
[]
[]
[null,"BIT INTEGRITA'",null,null,null,"Integrità"]
[null,1,null,null,null,{"$f":"CONTRIBUENTE!K138","v":4}]